sbuild (Debian sbuild) 0.89.3+deb13u4 (28 December 2025) on c7a-large-1789467031

+==============================================================================+
| python-darts.lib.utils.lru 0.5-6 (amd64)     Tue, 15 Sep 2026 10:15:20 +0000 |
+==============================================================================+

Package: python-darts.lib.utils.lru
Version: 0.5-6
Source Version: 0.5-6
Distribution: sid-unshare
Machine Architecture: amd64
Host Architecture: amd64
Build Architecture: amd64
Build Type: binary

I: Unpacking /var/lib/buildd/.cache/sbuild/sid-unshare-amd64.tar.gz to /tmp/tmp.sbuild.RyMZ5FdJFu...
I: Setting up the chroot...
I: Creating chroot session...
I: Setting up log color...
I: NOTICE: Log filtering will replace 'sbuild-unshare-dummy-location' with '<<CHROOT>>'
I: Setting up apt archive...
I: NOTICE: Log filtering will replace 'build/python-darts.lib.utils.lru-yskfwI/resolver-tYFzg3' with '<<RESOLVERDIR>>'

+------------------------------------------------------------------------------+
| Update chroot                                Tue, 15 Sep 2026 10:15:25 +0000 |
+------------------------------------------------------------------------------+

Get:1 http://deb.debian.org/debian sid InRelease [193 kB]
Get:2 http://deb.debian.org/debian sid/non-free Sources [84.2 kB]
Get:3 http://deb.debian.org/debian sid/non-free-firmware Sources [10.6 kB]
Get:4 http://deb.debian.org/debian sid/contrib Sources [65.0 kB]
Get:5 http://deb.debian.org/debian sid/main Sources [11.9 MB]
Get:6 http://deb.debian.org/debian sid/non-free-firmware amd64 Packages [10.8 kB]
Get:7 http://deb.debian.org/debian sid/contrib amd64 Packages [64.1 kB]
Get:8 http://deb.debian.org/debian sid/main amd64 Packages [10.8 MB]
Get:9 http://deb.debian.org/debian sid/non-free amd64 Packages [132 kB]
Fetched 23.3 MB in 1s (19.2 MB/s)
Reading package lists...
Reading package lists...
Building dependency tree...
Reading state information...
Calculating upgrade...
0 upgraded, 0 newly installed, 0 to remove and 0 not upgraded.

+------------------------------------------------------------------------------+
| Fetch source files                           Tue, 15 Sep 2026 10:15:27 +0000 |
+------------------------------------------------------------------------------+


Check APT
---------

Checking available source versions...

Download source files with APT
------------------------------

Reading package lists...
NOTICE: 'python-darts.lib.utils.lru' packaging is maintained in the 'Git' version control system at:
https://salsa.debian.org/pkg-security-team/python-darts.lib.utils.lru.git
Please use:
git clone https://salsa.debian.org/pkg-security-team/python-darts.lib.utils.lru.git
to retrieve the latest (possibly unreleased) updates to the package.
Need to get 27.0 kB of source archives.
Get:1 http://deb.debian.org/debian sid/main python-darts.lib.utils.lru 0.5-6 (dsc) [2274 B]
Get:2 http://deb.debian.org/debian sid/main python-darts.lib.utils.lru 0.5-6 (tar) [19.8 kB]
Get:3 http://deb.debian.org/debian sid/main python-darts.lib.utils.lru 0.5-6 (diff) [4880 B]
Fetched 27.0 kB in 0s (2213 kB/s)
Download complete and in download only mode
I: NOTICE: Log filtering will replace 'build/python-darts.lib.utils.lru-yskfwI/python-darts.lib.utils.lru-0.5' with '<<PKGBUILDDIR>>'
I: NOTICE: Log filtering will replace 'build/python-darts.lib.utils.lru-yskfwI' with '<<BUILDDIR>>'

+------------------------------------------------------------------------------+
| Install package build dependencies           Tue, 15 Sep 2026 10:15:27 +0000 |
+------------------------------------------------------------------------------+


Setup apt archive
-----------------

Merged Build-Depends: debhelper-compat (= 13), dh-python, python3-sphinx, python3-all, python3-setuptools, build-essential
Filtered Build-Depends: debhelper-compat (= 13), dh-python, python3-sphinx, python3-all, python3-setuptools, build-essential
dpkg-deb: building package 'sbuild-build-depends-main-dummy' in '/<<RESOLVERDIR>>/apt_archive/sbuild-build-depends-main-dummy.deb'.
Ign:1 copy:/<<RESOLVERDIR>>/apt_archive ./ InRelease
Get:2 copy:/<<RESOLVERDIR>>/apt_archive ./ Release [609 B]
Ign:3 copy:/<<RESOLVERDIR>>/apt_archive ./ Release.gpg
Get:4 copy:/<<RESOLVERDIR>>/apt_archive ./ Sources [660 B]
Get:5 copy:/<<RESOLVERDIR>>/apt_archive ./ Packages [699 B]
Fetched 1968 B in 0s (0 B/s)
Reading package lists...
Reading package lists...

Install main build dependencies (apt-based resolver)
----------------------------------------------------

Installing build dependencies
Reading package lists...
Building dependency tree...
Reading state information...
Solving dependencies...
The following additional packages will be installed:
  autoconf automake autopoint autotools-dev bsdextrautils ca-certificates
  debhelper dh-autoreconf dh-python dh-strip-nondeterminism docutils-common
  dwz file gettext gettext-base groff-base intltool-debian libarchive-zip-perl
  libdebhelper-perl libelf1t64 libexpat1 libffi8
  libfile-stripnondeterminism-perl libjs-sphinxdoc libjson-perl libmagic-mgc
  libmagic1t64 libncursesw6 libpipeline1 libpython3-stdlib
  libpython3.14-minimal libpython3.14-stdlib libreadline8t64 libsqlite3-0
  libtool libuchardet0 libunistring5 libxml2-16 m4 man-db media-types netbase
  openssl po-debconf python-babel-localedata python3 python3-alabaster
  python3-all python3-autocommand python3-babel python3-certifi
  python3-chardet python3-charset-normalizer python3-defusedxml
  python3-docutils python3-idna python3-imagesize python3-jaraco.context
  python3-jaraco.functools python3-jinja2 python3-markupsafe python3-minimal
  python3-more-itertools python3-packaging python3-pygments python3-requests
  python3-roman-numerals python3-setuptools python3-snowballstemmer
  python3-sphinx python3-urllib3 python3-zipp python3.14 python3.14-minimal
  readline-common sensible-utils sgml-base sphinx-common tzdata xml-core
Suggested packages:
  autoconf-archive gnu-standards autoconf-doc dh-make flit python3-build
  python3-installer python3-wheel gettext-doc libasprintf-dev libgettextpo-dev
  gnulib-l10n groff libtool-doc gfortran | fortran95-compiler m4-doc apparmor
  less www-browser libmail-box-perl python3-doc python3-tk python3-venv
  python-charset-normalizer-doc docutils-doc fonts-linuxlibertine
  | ttf-linux-libertine texlive-lang-french texlive-latex-base
  texlive-latex-recommended python-jinja2-doc python-pygments-doc
  ttf-bitstream-vera python3-cryptography python3-openssl python3-socks
  python-requests-doc python-setuptools-doc python3-stemmer dvipng dvisvgm
  fonts-freefont-otf imagemagick latexmk node-mathjax-full
  python3-sphinx-rtd-theme sphinx-doc tex-gyre texlive-fonts-extra
  texlive-fonts-recommended texlive-latex-extra texlive-plain-generic
  python3-brotli python3.14-venv python3.14-doc binfmt-support readline-doc
  sgml-base-doc
Recommended packages:
  curl | wget | lynx libarchive-cpio-perl libjson-xs-perl libgpm2 libltdl-dev
  libmail-sendmail-perl libpaper-utils python3-pil
The following NEW packages will be installed:
  autoconf automake autopoint autotools-dev bsdextrautils ca-certificates
  debhelper dh-autoreconf dh-python dh-strip-nondeterminism docutils-common
  dwz file gettext gettext-base groff-base intltool-debian libarchive-zip-perl
  libdebhelper-perl libelf1t64 libexpat1 libffi8
  libfile-stripnondeterminism-perl libjs-sphinxdoc libjson-perl libmagic-mgc
  libmagic1t64 libncursesw6 libpipeline1 libpython3-stdlib
  libpython3.14-minimal libpython3.14-stdlib libreadline8t64 libsqlite3-0
  libtool libuchardet0 libunistring5 libxml2-16 m4 man-db media-types netbase
  openssl po-debconf python-babel-localedata python3 python3-alabaster
  python3-all python3-autocommand python3-babel python3-certifi
  python3-chardet python3-charset-normalizer python3-defusedxml
  python3-docutils python3-idna python3-imagesize python3-jaraco.context
  python3-jaraco.functools python3-jinja2 python3-markupsafe python3-minimal
  python3-more-itertools python3-packaging python3-pygments python3-requests
  python3-roman-numerals python3-setuptools python3-snowballstemmer
  python3-sphinx python3-urllib3 python3-zipp python3.14 python3.14-minimal
  readline-common sbuild-build-depends-main-dummy sensible-utils sgml-base
  sphinx-common tzdata xml-core
0 upgraded, 81 newly installed, 0 to remove and 0 not upgraded.
Need to get 33.9 MB of archives.
After this operation, 149 MB of additional disk space will be used.
Get:1 copy:/<<RESOLVERDIR>>/apt_archive ./ sbuild-build-depends-main-dummy 0.invalid.0 [880 B]
Get:2 http://deb.debian.org/debian sid/main amd64 libexpat1 amd64 2.8.4-1 [130 kB]
Get:3 http://deb.debian.org/debian sid/main amd64 libpython3.14-minimal amd64 3.14.7-4 [902 kB]
Get:4 http://deb.debian.org/debian sid/main amd64 python3.14-minimal amd64 3.14.7-4 [2713 kB]
Get:5 http://deb.debian.org/debian sid/main amd64 python3-minimal amd64 3.14.7-3 [25.3 kB]
Get:6 http://deb.debian.org/debian sid/main amd64 media-types all 14.0.0 [30.8 kB]
Get:7 http://deb.debian.org/debian sid/main amd64 netbase all 6.6 [10.3 kB]
Get:8 http://deb.debian.org/debian sid/main amd64 tzdata all 2026c-1 [260 kB]
Get:9 http://deb.debian.org/debian sid/main amd64 libffi8 amd64 3.8.0-2 [32.5 kB]
Get:10 http://deb.debian.org/debian sid/main amd64 libncursesw6 amd64 6.6+20260608-2 [137 kB]
Get:11 http://deb.debian.org/debian sid/main amd64 readline-common all 8.3-4 [74.8 kB]
Get:12 http://deb.debian.org/debian sid/main amd64 libreadline8t64 amd64 8.3-4 [181 kB]
Get:13 http://deb.debian.org/debian sid/main amd64 libsqlite3-0 amd64 3.53.4-2 [974 kB]
Get:14 http://deb.debian.org/debian sid/main amd64 libpython3.14-stdlib amd64 3.14.7-4 [2362 kB]
Get:15 http://deb.debian.org/debian sid/main amd64 python3.14 amd64 3.14.7-4 [861 kB]
Get:16 http://deb.debian.org/debian sid/main amd64 libpython3-stdlib amd64 3.14.7-3 [8252 B]
Get:17 http://deb.debian.org/debian sid/main amd64 python3 amd64 3.14.7-3 [26.0 kB]
Get:18 http://deb.debian.org/debian sid/main amd64 sensible-utils all 0.0.26 [27.0 kB]
Get:19 http://deb.debian.org/debian sid/main amd64 openssl amd64 3.6.4-1 [1546 kB]
Get:20 http://deb.debian.org/debian sid/main amd64 ca-certificates all 20260816 [134 kB]
Get:21 http://deb.debian.org/debian sid/main amd64 libmagic-mgc amd64 1:5.47-4 [345 kB]
Get:22 http://deb.debian.org/debian sid/main amd64 libmagic1t64 amd64 1:5.47-4 [111 kB]
Get:23 http://deb.debian.org/debian sid/main amd64 file amd64 1:5.47-4 [43.0 kB]
Get:24 http://deb.debian.org/debian sid/main amd64 gettext-base amd64 1.0-5 [334 kB]
Get:25 http://deb.debian.org/debian sid/main amd64 libuchardet0 amd64 0.0.8-2+b2 [69.0 kB]
Get:26 http://deb.debian.org/debian sid/main amd64 groff-base amd64 1.24.1-1 [1336 kB]
Get:27 http://deb.debian.org/debian sid/main amd64 bsdextrautils amd64 2.42.3-1 [102 kB]
Get:28 http://deb.debian.org/debian sid/main amd64 libpipeline1 amd64 1.5.8-3 [49.2 kB]
Get:29 http://deb.debian.org/debian sid/main amd64 man-db amd64 2.13.1-1 [1469 kB]
Get:30 http://deb.debian.org/debian sid/main amd64 m4 amd64 1.4.21-1 [332 kB]
Get:31 http://deb.debian.org/debian sid/main amd64 autoconf all 2.73-2 [516 kB]
Get:32 http://deb.debian.org/debian sid/main amd64 autotools-dev all 20240727.1+nmu1 [60.0 kB]
Get:33 http://deb.debian.org/debian sid/main amd64 automake all 1:1.19-1 [891 kB]
Get:34 http://deb.debian.org/debian sid/main amd64 autopoint all 1.0-5 [820 kB]
Get:35 http://deb.debian.org/debian sid/main amd64 libdebhelper-perl all 14.4 [77.6 kB]
Get:36 http://deb.debian.org/debian sid/main amd64 libtool all 2.6.2-2 [553 kB]
Get:37 http://deb.debian.org/debian sid/main amd64 dh-autoreconf all 23 [12.7 kB]
Get:38 http://deb.debian.org/debian sid/main amd64 libarchive-zip-perl all 1.68-1 [104 kB]
Get:39 http://deb.debian.org/debian sid/main amd64 libfile-stripnondeterminism-perl all 1.15.1-1 [17.1 kB]
Get:40 http://deb.debian.org/debian sid/main amd64 dh-strip-nondeterminism all 1.15.1-1 [6020 B]
Get:41 http://deb.debian.org/debian sid/main amd64 libelf1t64 amd64 0.196-1 [61.2 kB]
Get:42 http://deb.debian.org/debian sid/main amd64 dwz amd64 0.17-1 [109 kB]
Get:43 http://deb.debian.org/debian sid/main amd64 libunistring5 amd64 1.4.2-1 [480 kB]
Get:44 http://deb.debian.org/debian sid/main amd64 libxml2-16 amd64 2.15.4+dfsg-1 [683 kB]
Get:45 http://deb.debian.org/debian sid/main amd64 gettext amd64 1.0-5 [2704 kB]
Get:46 http://deb.debian.org/debian sid/main amd64 intltool-debian all 0.35.0+20060710.6 [22.9 kB]
Get:47 http://deb.debian.org/debian sid/main amd64 po-debconf all 1.0.22 [216 kB]
Get:48 http://deb.debian.org/debian sid/main amd64 debhelper all 14.4 [944 kB]
Get:49 http://deb.debian.org/debian sid/main amd64 dh-python all 7.20260623 [114 kB]
Get:50 http://deb.debian.org/debian sid/main amd64 sgml-base all 1.31+nmu1 [10.9 kB]
Get:51 http://deb.debian.org/debian sid/main amd64 xml-core all 0.21 [19.0 kB]
Get:52 http://deb.debian.org/debian sid/main amd64 docutils-common all 0.23+dfsg-2 [124 kB]
Get:53 http://deb.debian.org/debian sid/main amd64 libjs-sphinxdoc all 9.1.0-7 [46.1 kB]
Get:54 http://deb.debian.org/debian sid/main amd64 libjson-perl all 4.10000-1 [87.5 kB]
Get:55 http://deb.debian.org/debian sid/main amd64 python-babel-localedata all 2.18.0+git2026-08-12-2 [6377 kB]
Get:56 http://deb.debian.org/debian sid/main amd64 python3-alabaster all 1.0.0-1 [20.4 kB]
Get:57 http://deb.debian.org/debian sid/main amd64 python3-all amd64 3.14.7-3 [984 B]
Get:58 http://deb.debian.org/debian sid/main amd64 python3-autocommand all 2.2.2-4 [13.7 kB]
Get:59 http://deb.debian.org/debian sid/main amd64 python3-babel all 2.18.0+git2026-08-12-2 [120 kB]
Get:60 http://deb.debian.org/debian sid/main amd64 python3-certifi all 2026.7.22+ds-1 [9928 B]
Get:61 http://deb.debian.org/debian sid/main amd64 python3-chardet all 5.2.0+dfsg-2 [108 kB]
Get:62 http://deb.debian.org/debian sid/main amd64 python3-charset-normalizer amd64 3.4.7-2+b1 [190 kB]
Get:63 http://deb.debian.org/debian sid/main amd64 python3-defusedxml all 0.7.1-3 [43.4 kB]
Get:64 http://deb.debian.org/debian sid/main amd64 python3-roman-numerals all 4.1.0-1 [9196 B]
Get:65 http://deb.debian.org/debian sid/main amd64 python3-docutils all 0.23+dfsg-2 [433 kB]
Get:66 http://deb.debian.org/debian sid/main amd64 python3-idna all 3.19-1 [45.2 kB]
Get:67 http://deb.debian.org/debian sid/main amd64 python3-imagesize all 2.0.1-1 [14.9 kB]
Get:68 http://deb.debian.org/debian sid/main amd64 python3-jaraco.context all 6.0.1-2 [8184 B]
Get:69 http://deb.debian.org/debian sid/main amd64 python3-more-itertools all 11.1.0-2 [74.5 kB]
Get:70 http://deb.debian.org/debian sid/main amd64 python3-jaraco.functools all 4.1.0-1 [12.0 kB]
Get:71 http://deb.debian.org/debian sid/main amd64 python3-markupsafe amd64 3.0.3-2+b1 [13.7 kB]
Get:72 http://deb.debian.org/debian sid/main amd64 python3-jinja2 all 3.1.6-3 [106 kB]
Get:73 http://deb.debian.org/debian sid/main amd64 python3-packaging all 26.2-2 [84.2 kB]
Get:74 http://deb.debian.org/debian sid/main amd64 python3-pygments all 2.20.0+dfsg-2 [850 kB]
Get:75 http://deb.debian.org/debian sid/main amd64 python3-urllib3 all 2.7.0-3 [119 kB]
Get:76 http://deb.debian.org/debian sid/main amd64 python3-requests all 2.34.2-1 [77.6 kB]
Get:77 http://deb.debian.org/debian sid/main amd64 python3-zipp all 3.23.0-1 [11.0 kB]
Get:78 http://deb.debian.org/debian sid/main amd64 python3-setuptools all 84.0.0-2 [560 kB]
Get:79 http://deb.debian.org/debian sid/main amd64 python3-snowballstemmer all 3.1.1-1 [61.9 kB]
Get:80 http://deb.debian.org/debian sid/main amd64 sphinx-common all 9.1.0-7 [700 kB]
Get:81 http://deb.debian.org/debian sid/main amd64 python3-sphinx all 9.1.0-7 [504 kB]
Preconfiguring packages ...
Fetched 33.9 MB in 0s (133 MB/s)
Selecting previously unselected package libexpat1:amd64.
(Reading database ... 11906 files and directories currently installed.)
Preparing to unpack .../libexpat1_2.8.4-1_amd64.deb ...
Unpacking libexpat1:amd64 (2.8.4-1) ...
Selecting previously unselected package libpython3.14-minimal:amd64.
Preparing to unpack .../libpython3.14-minimal_3.14.7-4_amd64.deb ...
Unpacking libpython3.14-minimal:amd64 (3.14.7-4) ...
Selecting previously unselected package python3.14-minimal.
Preparing to unpack .../python3.14-minimal_3.14.7-4_amd64.deb ...
Unpacking python3.14-minimal (3.14.7-4) ...
Setting up libpython3.14-minimal:amd64 (3.14.7-4) ...
Setting up libexpat1:amd64 (2.8.4-1) ...
Setting up python3.14-minimal (3.14.7-4) ...
Selecting previously unselected package python3-minimal.
(Reading database ... 12262 files and directories currently installed.)
Preparing to unpack .../00-python3-minimal_3.14.7-3_amd64.deb ...
Unpacking python3-minimal (3.14.7-3) ...
Selecting previously unselected package media-types.
Preparing to unpack .../01-media-types_14.0.0_all.deb ...
Unpacking media-types (14.0.0) ...
Selecting previously unselected package netbase.
Preparing to unpack .../02-netbase_6.6_all.deb ...
Unpacking netbase (6.6) ...
Selecting previously unselected package tzdata.
Preparing to unpack .../03-tzdata_2026c-1_all.deb ...
Unpacking tzdata (2026c-1) ...
Selecting previously unselected package libffi8:amd64.
Preparing to unpack .../04-libffi8_3.8.0-2_amd64.deb ...
Unpacking libffi8:amd64 (3.8.0-2) ...
Selecting previously unselected package libncursesw6:amd64.
Preparing to unpack .../05-libncursesw6_6.6+20260608-2_amd64.deb ...
Unpacking libncursesw6:amd64 (6.6+20260608-2) ...
Selecting previously unselected package readline-common.
Preparing to unpack .../06-readline-common_8.3-4_all.deb ...
Unpacking readline-common (8.3-4) ...
Selecting previously unselected package libreadline8t64:amd64.
Preparing to unpack .../07-libreadline8t64_8.3-4_amd64.deb ...
Adding 'diversion of /lib/x86_64-linux-gnu/libhistory.so.8 to /lib/x86_64-linux-gnu/libhistory.so.8.usr-is-merged by libreadline8t64'
Adding 'diversion of /lib/x86_64-linux-gnu/libhistory.so.8.2 to /lib/x86_64-linux-gnu/libhistory.so.8.2.usr-is-merged by libreadline8t64'
Adding 'diversion of /lib/x86_64-linux-gnu/libreadline.so.8 to /lib/x86_64-linux-gnu/libreadline.so.8.usr-is-merged by libreadline8t64'
Adding 'diversion of /lib/x86_64-linux-gnu/libreadline.so.8.2 to /lib/x86_64-linux-gnu/libreadline.so.8.2.usr-is-merged by libreadline8t64'
Unpacking libreadline8t64:amd64 (8.3-4) ...
Selecting previously unselected package libsqlite3-0:amd64.
Preparing to unpack .../08-libsqlite3-0_3.53.4-2_amd64.deb ...
Unpacking libsqlite3-0:amd64 (3.53.4-2) ...
Selecting previously unselected package libpython3.14-stdlib:amd64.
Preparing to unpack .../09-libpython3.14-stdlib_3.14.7-4_amd64.deb ...
Unpacking libpython3.14-stdlib:amd64 (3.14.7-4) ...
Selecting previously unselected package python3.14.
Preparing to unpack .../10-python3.14_3.14.7-4_amd64.deb ...
Unpacking python3.14 (3.14.7-4) ...
Selecting previously unselected package libpython3-stdlib:amd64.
Preparing to unpack .../11-libpython3-stdlib_3.14.7-3_amd64.deb ...
Unpacking libpython3-stdlib:amd64 (3.14.7-3) ...
Setting up python3-minimal (3.14.7-3) ...
Selecting previously unselected package python3.
(Reading database ... 13308 files and directories currently installed.)
Preparing to unpack .../00-python3_3.14.7-3_amd64.deb ...
Unpacking python3 (3.14.7-3) ...
Selecting previously unselected package sensible-utils.
Preparing to unpack .../01-sensible-utils_0.0.26_all.deb ...
Unpacking sensible-utils (0.0.26) ...
Selecting previously unselected package openssl.
Preparing to unpack .../02-openssl_3.6.4-1_amd64.deb ...
Unpacking openssl (3.6.4-1) ...
Selecting previously unselected package ca-certificates.
Preparing to unpack .../03-ca-certificates_20260816_all.deb ...
Unpacking ca-certificates (20260816) ...
Selecting previously unselected package libmagic-mgc.
Preparing to unpack .../04-libmagic-mgc_1%3a5.47-4_amd64.deb ...
Unpacking libmagic-mgc (1:5.47-4) ...
Selecting previously unselected package libmagic1t64:amd64.
Preparing to unpack .../05-libmagic1t64_1%3a5.47-4_amd64.deb ...
Unpacking libmagic1t64:amd64 (1:5.47-4) ...
Selecting previously unselected package file.
Preparing to unpack .../06-file_1%3a5.47-4_amd64.deb ...
Unpacking file (1:5.47-4) ...
Selecting previously unselected package gettext-base.
Preparing to unpack .../07-gettext-base_1.0-5_amd64.deb ...
Unpacking gettext-base (1.0-5) ...
Selecting previously unselected package libuchardet0:amd64.
Preparing to unpack .../08-libuchardet0_0.0.8-2+b2_amd64.deb ...
Unpacking libuchardet0:amd64 (0.0.8-2+b2) ...
Selecting previously unselected package groff-base.
Preparing to unpack .../09-groff-base_1.24.1-1_amd64.deb ...
Unpacking groff-base (1.24.1-1) ...
Selecting previously unselected package bsdextrautils.
Preparing to unpack .../10-bsdextrautils_2.42.3-1_amd64.deb ...
Unpacking bsdextrautils (2.42.3-1) ...
Selecting previously unselected package libpipeline1:amd64.
Preparing to unpack .../11-libpipeline1_1.5.8-3_amd64.deb ...
Unpacking libpipeline1:amd64 (1.5.8-3) ...
Selecting previously unselected package man-db.
Preparing to unpack .../12-man-db_2.13.1-1_amd64.deb ...
Unpacking man-db (2.13.1-1) ...
Selecting previously unselected package m4.
Preparing to unpack .../13-m4_1.4.21-1_amd64.deb ...
Unpacking m4 (1.4.21-1) ...
Selecting previously unselected package autoconf.
Preparing to unpack .../14-autoconf_2.73-2_all.deb ...
Unpacking autoconf (2.73-2) ...
Selecting previously unselected package autotools-dev.
Preparing to unpack .../15-autotools-dev_20240727.1+nmu1_all.deb ...
Unpacking autotools-dev (20240727.1+nmu1) ...
Selecting previously unselected package automake.
Preparing to unpack .../16-automake_1%3a1.19-1_all.deb ...
Unpacking automake (1:1.19-1) ...
Selecting previously unselected package autopoint.
Preparing to unpack .../17-autopoint_1.0-5_all.deb ...
Unpacking autopoint (1.0-5) ...
Selecting previously unselected package libdebhelper-perl.
Preparing to unpack .../18-libdebhelper-perl_14.4_all.deb ...
Unpacking libdebhelper-perl (14.4) ...
Selecting previously unselected package libtool.
Preparing to unpack .../19-libtool_2.6.2-2_all.deb ...
Unpacking libtool (2.6.2-2) ...
Selecting previously unselected package dh-autoreconf.
Preparing to unpack .../20-dh-autoreconf_23_all.deb ...
Unpacking dh-autoreconf (23) ...
Selecting previously unselected package libarchive-zip-perl.
Preparing to unpack .../21-libarchive-zip-perl_1.68-1_all.deb ...
Unpacking libarchive-zip-perl (1.68-1) ...
Selecting previously unselected package libfile-stripnondeterminism-perl.
Preparing to unpack .../22-libfile-stripnondeterminism-perl_1.15.1-1_all.deb ...
Unpacking libfile-stripnondeterminism-perl (1.15.1-1) ...
Selecting previously unselected package dh-strip-nondeterminism.
Preparing to unpack .../23-dh-strip-nondeterminism_1.15.1-1_all.deb ...
Unpacking dh-strip-nondeterminism (1.15.1-1) ...
Selecting previously unselected package libelf1t64:amd64.
Preparing to unpack .../24-libelf1t64_0.196-1_amd64.deb ...
Unpacking libelf1t64:amd64 (0.196-1) ...
Selecting previously unselected package dwz.
Preparing to unpack .../25-dwz_0.17-1_amd64.deb ...
Unpacking dwz (0.17-1) ...
Selecting previously unselected package libunistring5:amd64.
Preparing to unpack .../26-libunistring5_1.4.2-1_amd64.deb ...
Unpacking libunistring5:amd64 (1.4.2-1) ...
Selecting previously unselected package libxml2-16:amd64.
Preparing to unpack .../27-libxml2-16_2.15.4+dfsg-1_amd64.deb ...
Unpacking libxml2-16:amd64 (2.15.4+dfsg-1) ...
Selecting previously unselected package gettext.
Preparing to unpack .../28-gettext_1.0-5_amd64.deb ...
Unpacking gettext (1.0-5) ...
Selecting previously unselected package intltool-debian.
Preparing to unpack .../29-intltool-debian_0.35.0+20060710.6_all.deb ...
Unpacking intltool-debian (0.35.0+20060710.6) ...
Selecting previously unselected package po-debconf.
Preparing to unpack .../30-po-debconf_1.0.22_all.deb ...
Unpacking po-debconf (1.0.22) ...
Selecting previously unselected package debhelper.
Preparing to unpack .../31-debhelper_14.4_all.deb ...
Unpacking debhelper (14.4) ...
Selecting previously unselected package dh-python.
Preparing to unpack .../32-dh-python_7.20260623_all.deb ...
Unpacking dh-python (7.20260623) ...
Selecting previously unselected package sgml-base.
Preparing to unpack .../33-sgml-base_1.31+nmu1_all.deb ...
Unpacking sgml-base (1.31+nmu1) ...
Selecting previously unselected package xml-core.
Preparing to unpack .../34-xml-core_0.21_all.deb ...
Unpacking xml-core (0.21) ...
Selecting previously unselected package docutils-common.
Preparing to unpack .../35-docutils-common_0.23+dfsg-2_all.deb ...
Unpacking docutils-common (0.23+dfsg-2) ...
Selecting previously unselected package libjs-sphinxdoc.
Preparing to unpack .../36-libjs-sphinxdoc_9.1.0-7_all.deb ...
Unpacking libjs-sphinxdoc (9.1.0-7) ...
Selecting previously unselected package libjson-perl.
Preparing to unpack .../37-libjson-perl_4.10000-1_all.deb ...
Unpacking libjson-perl (4.10000-1) ...
Selecting previously unselected package python-babel-localedata.
Preparing to unpack .../38-python-babel-localedata_2.18.0+git2026-08-12-2_all.deb ...
Unpacking python-babel-localedata (2.18.0+git2026-08-12-2) ...
Selecting previously unselected package python3-alabaster.
Preparing to unpack .../39-python3-alabaster_1.0.0-1_all.deb ...
Unpacking python3-alabaster (1.0.0-1) ...
Selecting previously unselected package python3-all.
Preparing to unpack .../40-python3-all_3.14.7-3_amd64.deb ...
Unpacking python3-all (3.14.7-3) ...
Selecting previously unselected package python3-autocommand.
Preparing to unpack .../41-python3-autocommand_2.2.2-4_all.deb ...
Unpacking python3-autocommand (2.2.2-4) ...
Selecting previously unselected package python3-babel.
Preparing to unpack .../42-python3-babel_2.18.0+git2026-08-12-2_all.deb ...
Unpacking python3-babel (2.18.0+git2026-08-12-2) ...
Selecting previously unselected package python3-certifi.
Preparing to unpack .../43-python3-certifi_2026.7.22+ds-1_all.deb ...
Unpacking python3-certifi (2026.7.22+ds-1) ...
Selecting previously unselected package python3-chardet.
Preparing to unpack .../44-python3-chardet_5.2.0+dfsg-2_all.deb ...
Unpacking python3-chardet (5.2.0+dfsg-2) ...
Selecting previously unselected package python3-charset-normalizer.
Preparing to unpack .../45-python3-charset-normalizer_3.4.7-2+b1_amd64.deb ...
Unpacking python3-charset-normalizer (3.4.7-2+b1) ...
Selecting previously unselected package python3-defusedxml.
Preparing to unpack .../46-python3-defusedxml_0.7.1-3_all.deb ...
Unpacking python3-defusedxml (0.7.1-3) ...
Selecting previously unselected package python3-roman-numerals.
Preparing to unpack .../47-python3-roman-numerals_4.1.0-1_all.deb ...
Unpacking python3-roman-numerals (4.1.0-1) ...
Selecting previously unselected package python3-docutils.
Preparing to unpack .../48-python3-docutils_0.23+dfsg-2_all.deb ...
Unpacking python3-docutils (0.23+dfsg-2) ...
Selecting previously unselected package python3-idna.
Preparing to unpack .../49-python3-idna_3.19-1_all.deb ...
Unpacking python3-idna (3.19-1) ...
Selecting previously unselected package python3-imagesize.
Preparing to unpack .../50-python3-imagesize_2.0.1-1_all.deb ...
Unpacking python3-imagesize (2.0.1-1) ...
Selecting previously unselected package python3-jaraco.context.
Preparing to unpack .../51-python3-jaraco.context_6.0.1-2_all.deb ...
Unpacking python3-jaraco.context (6.0.1-2) ...
Selecting previously unselected package python3-more-itertools.
Preparing to unpack .../52-python3-more-itertools_11.1.0-2_all.deb ...
Unpacking python3-more-itertools (11.1.0-2) ...
Selecting previously unselected package python3-jaraco.functools.
Preparing to unpack .../53-python3-jaraco.functools_4.1.0-1_all.deb ...
Unpacking python3-jaraco.functools (4.1.0-1) ...
Selecting previously unselected package python3-markupsafe.
Preparing to unpack .../54-python3-markupsafe_3.0.3-2+b1_amd64.deb ...
Unpacking python3-markupsafe (3.0.3-2+b1) ...
Selecting previously unselected package python3-jinja2.
Preparing to unpack .../55-python3-jinja2_3.1.6-3_all.deb ...
Unpacking python3-jinja2 (3.1.6-3) ...
Selecting previously unselected package python3-packaging.
Preparing to unpack .../56-python3-packaging_26.2-2_all.deb ...
Unpacking python3-packaging (26.2-2) ...
Selecting previously unselected package python3-pygments.
Preparing to unpack .../57-python3-pygments_2.20.0+dfsg-2_all.deb ...
Unpacking python3-pygments (2.20.0+dfsg-2) ...
Selecting previously unselected package python3-urllib3.
Preparing to unpack .../58-python3-urllib3_2.7.0-3_all.deb ...
Unpacking python3-urllib3 (2.7.0-3) ...
Selecting previously unselected package python3-requests.
Preparing to unpack .../59-python3-requests_2.34.2-1_all.deb ...
Unpacking python3-requests (2.34.2-1) ...
Selecting previously unselected package python3-zipp.
Preparing to unpack .../60-python3-zipp_3.23.0-1_all.deb ...
Unpacking python3-zipp (3.23.0-1) ...
Selecting previously unselected package python3-setuptools.
Preparing to unpack .../61-python3-setuptools_84.0.0-2_all.deb ...
Unpacking python3-setuptools (84.0.0-2) ...
Selecting previously unselected package python3-snowballstemmer.
Preparing to unpack .../62-python3-snowballstemmer_3.1.1-1_all.deb ...
Unpacking python3-snowballstemmer (3.1.1-1) ...
Selecting previously unselected package sphinx-common.
Preparing to unpack .../63-sphinx-common_9.1.0-7_all.deb ...
Unpacking sphinx-common (9.1.0-7) ...
Selecting previously unselected package python3-sphinx.
Preparing to unpack .../64-python3-sphinx_9.1.0-7_all.deb ...
Unpacking python3-sphinx (9.1.0-7) ...
Selecting previously unselected package sbuild-build-depends-main-dummy.
Preparing to unpack .../65-sbuild-build-depends-main-dummy_0.invalid.0_amd64.deb ...
Unpacking sbuild-build-depends-main-dummy (0.invalid.0) ...
Setting up media-types (14.0.0) ...
Setting up libpipeline1:amd64 (1.5.8-3) ...
Setting up bsdextrautils (2.42.3-1) ...
Setting up libmagic-mgc (1:5.47-4) ...
Setting up libarchive-zip-perl (1.68-1) ...
Setting up libxml2-16:amd64 (2.15.4+dfsg-1) ...
Setting up libdebhelper-perl (14.4) ...
Setting up libsqlite3-0:amd64 (3.53.4-2) ...
Setting up libmagic1t64:amd64 (1:5.47-4) ...
Setting up gettext-base (1.0-5) ...
Setting up m4 (1.4.21-1) ...
Setting up file (1:5.47-4) ...
Setting up libelf1t64:amd64 (0.196-1) ...
Setting up python-babel-localedata (2.18.0+git2026-08-12-2) ...
Setting up tzdata (2026c-1) ...

Current default time zone: 'Etc/UTC'
Local time is now:      Tue Sep 15 10:15:38 UTC 2026.
Universal Time is now:  Tue Sep 15 10:15:38 UTC 2026.
Run 'dpkg-reconfigure tzdata' if you wish to change it.

Setting up autotools-dev (20240727.1+nmu1) ...
Setting up libunistring5:amd64 (1.4.2-1) ...
Setting up autopoint (1.0-5) ...
Setting up libncursesw6:amd64 (6.6+20260608-2) ...
Setting up libjs-sphinxdoc (9.1.0-7) ...
Setting up autoconf (2.73-2) ...
Setting up libffi8:amd64 (3.8.0-2) ...
Setting up dwz (0.17-1) ...
Setting up sensible-utils (0.0.26) ...
Setting up libuchardet0:amd64 (0.0.8-2+b2) ...
Setting up libjson-perl (4.10000-1) ...
Setting up netbase (6.6) ...
Setting up sgml-base (1.31+nmu1) ...
Setting up openssl (3.6.4-1) ...
Setting up readline-common (8.3-4) ...
Setting up automake (1:1.19-1) ...
update-alternatives: using /usr/bin/automake-1.19 to provide /usr/bin/automake (automake) in auto mode
Setting up libfile-stripnondeterminism-perl (1.15.1-1) ...
Setting up gettext (1.0-5) ...
Setting up libtool (2.6.2-2) ...
Setting up intltool-debian (0.35.0+20060710.6) ...
Setting up dh-autoreconf (23) ...
Setting up ca-certificates (20260816) ...
Updating certificates in /etc/ssl/certs...
121 added, 0 removed; done.
Setting up sphinx-common (9.1.0-7) ...
Setting up libreadline8t64:amd64 (8.3-4) ...
Setting up dh-strip-nondeterminism (1.15.1-1) ...
Setting up groff-base (1.24.1-1) ...
Setting up xml-core (0.21) ...
Setting up libpython3.14-stdlib:amd64 (3.14.7-4) ...
Setting up po-debconf (1.0.22) ...
Setting up man-db (2.13.1-1) ...
Not building database; man-db/auto-update is not 'true'.
Setting up python3.14 (3.14.7-4) ...
Setting up libpython3-stdlib:amd64 (3.14.7-3) ...
Setting up debhelper (14.4) ...
Setting up python3 (3.14.7-3) ...
Setting up python3-zipp (3.23.0-1) ...
Setting up python3-autocommand (2.2.2-4) ...
Setting up python3-markupsafe (3.0.3-2+b1) ...
Setting up python3-jinja2 (3.1.6-3) ...
Setting up python3-pygments (2.20.0+dfsg-2) ...
Setting up python3-packaging (26.2-2) ...
Setting up python3-chardet (5.2.0+dfsg-2) ...
Setting up python3-certifi (2026.7.22+ds-1) ...
Setting up python3-snowballstemmer (3.1.1-1) ...
Setting up python3-idna (3.19-1) ...
Setting up python3-urllib3 (2.7.0-3) ...
Setting up python3-roman-numerals (4.1.0-1) ...
Setting up python3-imagesize (2.0.1-1) ...
Setting up dh-python (7.20260623) ...
Setting up python3-more-itertools (11.1.0-2) ...
Setting up python3-jaraco.functools (4.1.0-1) ...
Setting up python3-jaraco.context (6.0.1-2) ...
Setting up python3-babel (2.18.0+git2026-08-12-2) ...
update-alternatives: using /usr/bin/pybabel-python3 to provide /usr/bin/pybabel (pybabel) in auto mode
Setting up python3-defusedxml (0.7.1-3) ...
Setting up python3-charset-normalizer (3.4.7-2+b1) ...
Setting up python3-alabaster (1.0.0-1) ...
Setting up python3-all (3.14.7-3) ...
Setting up python3-requests (2.34.2-1) ...
Setting up python3-setuptools (84.0.0-2) ...
Processing triggers for libc-bin (2.43-5) ...
Processing triggers for sgml-base (1.31+nmu1) ...
Setting up docutils-common (0.23+dfsg-2) ...
Processing triggers for sgml-base (1.31+nmu1) ...
Setting up python3-docutils (0.23+dfsg-2) ...
Setting up python3-sphinx (9.1.0-7) ...
Setting up sbuild-build-depends-main-dummy (0.invalid.0) ...
Processing triggers for ca-certificates (20260816) ...
Updating certificates in /etc/ssl/certs...
0 added, 0 removed; done.
Running hooks in /etc/ca-certificates/update.d...
done.

+------------------------------------------------------------------------------+
| Check architectures                          Tue, 15 Sep 2026 10:15:45 +0000 |
+------------------------------------------------------------------------------+

Arch check ok (amd64 included in all)

+------------------------------------------------------------------------------+
| Build environment                            Tue, 15 Sep 2026 10:15:46 +0000 |
+------------------------------------------------------------------------------+

Kernel: Linux 6.12.107+deb13-cloud-amd64 #1 SMP PREEMPT_DYNAMIC Debian 6.12.107-1 (2026-08-29) amd64 (x86_64)
Toolchain package versions: binutils_2.47-6 dpkg-dev_1.23.11 g++-16_16.2.0-2 gcc-16_16.2.0-2 libc6-dev_2.43-5 libstdc++-16-dev_16.2.0-2 libstdc++6_16.2.0-2 linux-libc-dev_7.1.13-1
Package versions: apt_3.3.3 autoconf_2.73-2 automake_1:1.19-1 autopoint_1.0-5 autotools-dev_20240727.1+nmu1 base-files_14.2 base-passwd_3.6.8 bash_5.3-4 binutils_2.47-6 binutils-common_2.47-6 binutils-x86-64-linux-gnu_2.47-6 bsdextrautils_2.42.3-1 build-essential_12.12 bzip2_1.0.8-6+b2 ca-certificates_20260816 coreutils_9.10-1 cpp_4:16.1.0-3 cpp-16_16.2.0-2 cpp-16-x86-64-linux-gnu_16.2.0-2 cpp-x86-64-linux-gnu_4:16.1.0-3 dash_0.5.12-12 debconf_1.5.92 debhelper_14.4 debian-archive-keyring_2025.1 debianutils_5.24 dh-autoreconf_23 dh-python_7.20260623 dh-strip-nondeterminism_1.15.1-1 diffutils_1:3.12-1 docutils-common_0.23+dfsg-2 dpkg_1.23.11 dpkg-dev_1.23.11 dwz_0.17-1 file_1:5.47-4 findutils_4.11.0-2 g++_4:16.1.0-3 g++-16_16.2.0-2 g++-16-x86-64-linux-gnu_16.2.0-2 g++-x86-64-linux-gnu_4:16.1.0-3 gcc_4:16.1.0-3 gcc-16_16.2.0-2 gcc-16-base_16.2.0-2 gcc-16-x86-64-linux-gnu_16.2.0-2 gcc-x86-64-linux-gnu_4:16.1.0-3 gettext_1.0-5 gettext-base_1.0-5 grep_3.12-1 groff-base_1.24.1-1 gzip_1.14-1 hostname_3.25 init-system-helpers_1.69+nmu1 intltool-debian_0.35.0+20060710.6 libacl1_2.4.0-1 libapt-pkg7.0_3.3.3 libarchive-zip-perl_1.68-1 libasan8_16.2.0-2 libatomic1_16.2.0-2 libattr1_1:2.6.0-1 libaudit-common_1:4.1.2-1 libaudit1_1:4.1.2-1+b2 libbinutils_2.47-6 libblkid1_2.42.3-1 libbz2-1.0_1.0.8-6+b2 libc-bin_2.43-5 libc-dev-bin_2.43-5 libc-gconv-modules-extra_2.43-5 libc6_2.43-5 libc6-dev_2.43-5 libcap-ng0_0.9.6-1 libcc1-0_16.2.0-2 libcrypt1_1:4.5.2+20251210-1 libctf-nobfd0_2.47-6 libctf0_2.47-6 libdb5.3t64_5.3.28+dfsg2-11+b1 libdebconfclient0_0.283 libdebhelper-perl_14.4 libdpkg-perl_1.23.11 libelf1t64_0.196-1 libexpat1_2.8.4-1 libffi8_3.8.0-2 libfile-stripnondeterminism-perl_1.15.1-1 libgcc-16-dev_16.2.0-2 libgcc-s1_16.2.0-2 libgdbm-compat4t64_1.26-1+b2 libgdbm6t64_1.26-1+b2 libgmp10_2:6.3.0+dfsg-5+b2 libgomp1_16.2.0-2 libgprofng0_2.47-6 libhogweed6t64_3.10.2-1+b1 libhwasan0_16.2.0-2 libisl23_0.28-1 libitm1_16.2.0-2 libjansson4_2.15.1-1 libjs-sphinxdoc_9.1.0-7 libjson-perl_4.10000-1 liblsan0_16.2.0-2 liblz4-1_1.10.0-10 liblzma5_5.8.4-1 libmagic-mgc_1:5.47-4 libmagic1t64_1:5.47-4 libmd0_1.2.0-2 libmount1_2.42.3-1 libmpc3_1.3.1-3 libmpfr6_4.2.2-3 libncursesw6_6.6+20260608-2 libnettle8t64_3.10.2-1+b1 libpam-modules_1.7.0-8 libpam-modules-bin_1.7.0-8 libpam-runtime_1.7.0-8 libpam0g_1.7.0-8 libpcre2-8-0_10.48-3 libperl5.42_5.42.3-1 libpipeline1_1.5.8-3 libpython3-stdlib_3.14.7-3 libpython3.14-minimal_3.14.7-4 libpython3.14-stdlib_3.14.7-4 libquadmath0_16.2.0-2 libreadline8t64_8.3-4 libseccomp2_2.6.1-1+b1 libselinux1_3.11-2 libsframe3_2.47-6 libsmartcols1_2.42.3-1 libsqlite3-0_3.53.4-2 libssl3t64_3.6.4-1 libstdc++-16-dev_16.2.0-2 libstdc++6_16.2.0-2 libsystemd0_262~rc2-1 libtinfo6_6.6+20260608-2 libtool_2.6.2-2 libtsan2_16.2.0-2 libubsan1_16.2.0-2 libuchardet0_0.0.8-2+b2 libudev1_262~rc2-1 libunistring5_1.4.2-1 libuuid1_2.42.3-1 libxml2-16_2.15.4+dfsg-1 libxxhash0_0.8.3-2+b2 libzstd1_1.5.7+dfsg-4 linux-libc-dev_7.1.13-1 m4_1.4.21-1 make_4.4.1-3 man-db_2.13.1-1 mawk_1.3.4.20260302-1 media-types_14.0.0 ncurses-base_6.6+20260608-2 ncurses-bin_6.6+20260608-2 netbase_6.6 openssl_3.6.4-1 openssl-provider-legacy_3.6.4-1 patch_2.8-2 perl_5.42.3-1 perl-base_5.42.3-1 perl-modules-5.42_5.42.3-1 po-debconf_1.0.22 python-babel-localedata_2.18.0+git2026-08-12-2 python3_3.14.7-3 python3-alabaster_1.0.0-1 python3-all_3.14.7-3 python3-autocommand_2.2.2-4 python3-babel_2.18.0+git2026-08-12-2 python3-certifi_2026.7.22+ds-1 python3-chardet_5.2.0+dfsg-2 python3-charset-normalizer_3.4.7-2+b1 python3-defusedxml_0.7.1-3 python3-docutils_0.23+dfsg-2 python3-idna_3.19-1 python3-imagesize_2.0.1-1 python3-jaraco.context_6.0.1-2 python3-jaraco.functools_4.1.0-1 python3-jinja2_3.1.6-3 python3-markupsafe_3.0.3-2+b1 python3-minimal_3.14.7-3 python3-more-itertools_11.1.0-2 python3-packaging_26.2-2 python3-pygments_2.20.0+dfsg-2 python3-requests_2.34.2-1 python3-roman-numerals_4.1.0-1 python3-setuptools_84.0.0-2 python3-snowballstemmer_3.1.1-1 python3-sphinx_9.1.0-7 python3-urllib3_2.7.0-3 python3-zipp_3.23.0-1 python3.14_3.14.7-4 python3.14-minimal_3.14.7-4 readline-common_8.3-4 sbuild-build-depends-main-dummy_0.invalid.0 sed_4.9-3 sensible-utils_0.0.26 sgml-base_1.31+nmu1 sphinx-common_9.1.0-7 sqv_1.5.0-1 sysvinit-utils_3.18-1 tar_1.35+dfsg-5 tzdata_2026c-1 util-linux_2.42.3-1 xml-core_0.21 xz-utils_5.8.4-1 zlib1g_1:1.3.dfsg+really1.3.2-3

+------------------------------------------------------------------------------+
| Build                                        Tue, 15 Sep 2026 10:15:46 +0000 |
+------------------------------------------------------------------------------+


Unpack source
-------------

-----BEGIN PGP SIGNED MESSAGE-----
Hash: SHA256

Format: 3.0 (quilt)
Source: python-darts.lib.utils.lru
Binary: python3-darts.lib.utils.lru, python-darts.lib.utils.lru-doc
Architecture: all
Version: 0.5-6
Maintainer: Debian Security Tools <team+pkg-security@tracker.debian.org>
Uploaders: Gianfranco Costamagna <locutusofborg@debian.org>
Homepage: https://pypi.python.org/pypi/darts.util.lru
Standards-Version: 4.6.0
Vcs-Browser: https://salsa.debian.org/pkg-security-team/python-darts.lib.utils.lru
Vcs-Git: https://salsa.debian.org/pkg-security-team/python-darts.lib.utils.lru.git
Build-Depends: debhelper-compat (= 13), dh-python, python3-sphinx, python3-all, python3-setuptools
Package-List:
 python-darts.lib.utils.lru-doc deb doc optional arch=all
 python3-darts.lib.utils.lru deb python optional arch=all
Checksums-Sha1:
 e50e3871b82db84b1cc67881a6b4a126af8ad675 19838 python-darts.lib.utils.lru_0.5.orig.tar.gz
 16ecbc3cb76785301003d1341a3d4cd252f946c2 4880 python-darts.lib.utils.lru_0.5-6.debian.tar.xz
Checksums-Sha256:
 f3016ff8d004aadf27951e6b5715e2d097c0b57d988c5ef19eba79c7779f3765 19838 python-darts.lib.utils.lru_0.5.orig.tar.gz
 e23cbeb28536089039150306069401852e67d82eb47bee719608b9d6f8a89180 4880 python-darts.lib.utils.lru_0.5-6.debian.tar.xz
Files:
 e4b97ad322993c6d7d65f989007a5938 19838 python-darts.lib.utils.lru_0.5.orig.tar.gz
 c2e777ca7e058043df14e04b2d1aad94 4880 python-darts.lib.utils.lru_0.5-6.debian.tar.xz

-----BEGIN PGP SIGNATURE-----

iQIzBAEBCAAdFiEEkpeKbhleSSGCX3/w808JdE6fXdkFAmI9gKwACgkQ808JdE6f
Xdkm3hAAktvN5Kc1JGEgpMWqUT4jtTXOJegcSg6i1dQGf8ngkVd48xvlVzUkCvC1
Pb0rzMWxeHZ5sc3wdesMpKjZdEI9j5J+mC+kjrFzR89GlnbWT27V3/0EcooG0pzn
+L1H/ET7EslqqFITkcmEPyhx4Mu+/VldeacmcxI0TAklySTKHeVTLLb3QNl7VQR/
AZlAHhTl1lgoaeGU/7F++4Rj7gg9FBqy30PTjgKDxHHYJ1GAPAMTNYlVaMv0twKx
mnd/dd5/6nScjuXHYSo3kZpJHVcTioM7RRxLw5acJU/EQOMiUxnyobLIfeAsGfei
bgfnpkaP4ObCgbg5OasEojew9IotIJh742PQvow2uTi6x0srhIRQAAZJGF+NAVAM
vrShuQh6xViBT9AFLXRH9SOinjGXLuzXPkSq+nU21NZEhEX4VquTv3ABnF3x/6yO
OcSfC6QDTk863IQM4X3iw4fpcW4rqW9ThLvvfDml40jEMQ0TwZk8yfXhjlOTY0KT
ms8gVNtcVDEiLvLa7ibUEMX3XbRTfsw+m7/k4M45f8V/FKdDN88qZ/G8IeDPo3uc
G0rgx28hHFCAq9O+7qOBguL4981pxd8SvwadFbPXnhga0+zOuCPGzeHv/A77voWT
ZTmBdiQFiWzDjgO4bTP5H3+SXh41K/x+l4xjfouyxzrmvaxy09w=
=voq7
-----END PGP SIGNATURE-----

dpkg-source: warning: cannot verify inline signature for ./python-darts.lib.utils.lru_0.5-6.dsc: missing OpenPGP keyrings
dpkg-source: info: verifying ./python-darts.lib.utils.lru_0.5-6.dsc
dpkg-source: info: skipping absent keyring /usr/share/keyrings/debian-keyring.pgp
dpkg-source: info: skipping absent keyring /usr/share/keyrings/debian-tag2upload.pgp
dpkg-source: info: skipping absent keyring /usr/share/keyrings/debian-nonupload.pgp
dpkg-source: info: skipping absent keyring /usr/share/keyrings/debian-maintainers.pgp
dpkg-source: info: extracting python-darts.lib.utils.lru in /<<PKGBUILDDIR>>
dpkg-source: info: unpacking python-darts.lib.utils.lru_0.5.orig.tar.gz
dpkg-source: info: unpacking python-darts.lib.utils.lru_0.5-6.debian.tar.xz
dpkg-source: info: using patch list from debian/patches/series
dpkg-source: info: applying 4.patch

Check disk space
----------------

Sufficient free space for build

User Environment
----------------

APT_CONFIG=/var/lib/sbuild/apt.conf
DEB_BUILD_OPTIONS=parallel=2
HOME=/sbuild-nonexistent
LC_ALL=C.UTF-8
LOGNAME=sbuild
PATH=/usr/local/sbin:/usr/local/bin:/usr/sbin:/usr/bin:/sbin:/bin:/usr/games
SHELL=/bin/sh
USER=sbuild

dpkg-buildpackage
-----------------

Command: dpkg-buildpackage --sanitize-env -us -uc -b
dpkg-buildpackage: info: source package python-darts.lib.utils.lru
dpkg-buildpackage: info: source version 0.5-6
dpkg-buildpackage: info: source distribution unstable
dpkg-buildpackage: info: source changed by Gianfranco Costamagna <locutusofborg@debian.org>
 dpkg-source --before-build .
dpkg-buildpackage: info: host architecture amd64
 debian/rules clean
dh clean --with python3,sphinxdoc --buildsystem=pybuild
   debian/rules override_dh_auto_clean
make[1]: Entering directory '/<<PKGBUILDDIR>>'
rm -rf doc/build
dh_auto_clean
I: pybuild base:385: python3.14 setup.py clean 
/usr/lib/python3/dist-packages/setuptools/dist.py:810: SetuptoolsDeprecationWarning: The namespace_packages parameter is deprecated.
!!

        ********************************************************************************
        Please replace its usage with implicit namespaces (PEP 420).

        See https://setuptools.pypa.io/en/latest/references/keywords.html#keyword-namespace-packages for details.
        ********************************************************************************

!!
  ep.load()(self, ep.name, value)
running clean
removing '/<<PKGBUILDDIR>>/.pybuild/cpython3_3.14_darts.lib.utils.lru/build' (and everything under it)
'build/bdist.linux-x86_64' does not exist -- can't clean it
'build/scripts-3.14' does not exist -- can't clean it
make[1]: Leaving directory '/<<PKGBUILDDIR>>'
   dh_autoreconf_clean -O--buildsystem=pybuild
   dh_clean -O--buildsystem=pybuild
 debian/rules binary
dh binary --with python3,sphinxdoc --buildsystem=pybuild
   dh_update_autotools_config -O--buildsystem=pybuild
   dh_autoreconf -O--buildsystem=pybuild
   dh_auto_configure -O--buildsystem=pybuild
I: pybuild base:385: python3.14 setup.py config 
/usr/lib/python3/dist-packages/setuptools/dist.py:810: SetuptoolsDeprecationWarning: The namespace_packages parameter is deprecated.
!!

        ********************************************************************************
        Please replace its usage with implicit namespaces (PEP 420).

        See https://setuptools.pypa.io/en/latest/references/keywords.html#keyword-namespace-packages for details.
        ********************************************************************************

!!
  ep.load()(self, ep.name, value)
running config
   debian/rules override_dh_auto_build
make[1]: Entering directory '/<<PKGBUILDDIR>>'
dh_auto_build
I: pybuild base:385: /usr/bin/python3 setup.py build 
/usr/lib/python3/dist-packages/setuptools/dist.py:810: SetuptoolsDeprecationWarning: The namespace_packages parameter is deprecated.
!!

        ********************************************************************************
        Please replace its usage with implicit namespaces (PEP 420).

        See https://setuptools.pypa.io/en/latest/references/keywords.html#keyword-namespace-packages for details.
        ********************************************************************************

!!
  ep.load()(self, ep.name, value)
running build
running build_py
creating /<<PKGBUILDDIR>>/.pybuild/cpython3_3.14_darts.lib.utils.lru/build/darts
copying darts/__init__.py -> /<<PKGBUILDDIR>>/.pybuild/cpython3_3.14_darts.lib.utils.lru/build/darts
creating /<<PKGBUILDDIR>>/.pybuild/cpython3_3.14_darts.lib.utils.lru/build/darts/lib
copying darts/lib/__init__.py -> /<<PKGBUILDDIR>>/.pybuild/cpython3_3.14_darts.lib.utils.lru/build/darts/lib
creating /<<PKGBUILDDIR>>/.pybuild/cpython3_3.14_darts.lib.utils.lru/build/darts/lib/utils
copying darts/lib/utils/lru.py -> /<<PKGBUILDDIR>>/.pybuild/cpython3_3.14_darts.lib.utils.lru/build/darts/lib/utils
copying darts/lib/utils/__init__.py -> /<<PKGBUILDDIR>>/.pybuild/cpython3_3.14_darts.lib.utils.lru/build/darts/lib/utils
sphinx-build -b html doc doc/build/html
Running Sphinx v9.1.0
loading translations [en]... done
making output directory... done
Converting `source_suffix = '.txt'` to `source_suffix = {'.txt': 'restructuredtext'}`.
building [mo]: targets for 0 po files that are out of date
writing output... 
building [html]: targets for 1 source files that are out of date
updating environment: [new config] 1 added, 0 changed, 0 removed
reading sources... [100%] index

looking for now-outdated files... none found
pickling environment... done
checking consistency... done
preparing documents... done
copying assets... 
copying static files... 
Writing evaluated template result to /<<PKGBUILDDIR>>/doc/build/html/_static/language_data.js
Writing evaluated template result to /<<PKGBUILDDIR>>/doc/build/html/_static/documentation_options.js
Writing evaluated template result to /<<PKGBUILDDIR>>/doc/build/html/_static/basic.css
Writing evaluated template result to /<<PKGBUILDDIR>>/doc/build/html/_static/sidebar.js
Writing evaluated template result to /<<PKGBUILDDIR>>/doc/build/html/_static/classic.css
copying static files: done
copying extra files... 
copying extra files: done
copying assets: done
writing output... [100%] index

generating indices... genindex py-modindex done
writing additional pages... search done
dumping search index in English (code: en)... done
dumping object inventory... done
build succeeded.

The HTML pages are in doc/build/html.
make[1]: Leaving directory '/<<PKGBUILDDIR>>'
   dh_auto_test -O--buildsystem=pybuild
W: pybuild base:328: No test runner selected, defaulting to unittest, ignoring test discovery problems.
Use --test-unittest to explicitly select the unittest runner.
I: pybuild base:385: cd /<<PKGBUILDDIR>>/.pybuild/cpython3_3.14_darts.lib.utils.lru/build; python3.14 -m unittest discover -v 
darts (unittest.loader._FailedTest.darts) ... ERROR

======================================================================
ERROR: darts (unittest.loader._FailedTest.darts)
----------------------------------------------------------------------
ImportError: Failed to import test module: darts
Traceback (most recent call last):
  File "/usr/lib/python3.14/unittest/loader.py", line 467, in _find_test_path
    package = self._get_module_from_name(name)
  File "/usr/lib/python3.14/unittest/loader.py", line 374, in _get_module_from_name
    __import__(name)
    ~~~~~~~~~~^^^^^^
  File "/<<PKGBUILDDIR>>/.pybuild/cpython3_3.14_darts.lib.utils.lru/build/darts/__init__.py", line 1, in <module>
    __import__('pkg_resources').declare_namespace(__name__)
    ~~~~~~~~~~^^^^^^^^^^^^^^^^^
ModuleNotFoundError: No module named 'pkg_resources'


----------------------------------------------------------------------
Ran 1 test in 0.000s

FAILED (errors=1)
E: pybuild pybuild:485: test: plugin distutils failed with: exit code=1: cd /<<PKGBUILDDIR>>/.pybuild/cpython3_3.14_darts.lib.utils.lru/build; python3.14 -m unittest discover -v 
dh_auto_test: error: pybuild --test -i python{version} -p 3.14 --parallel=2 returned exit code 13
make: *** [debian/rules:5: binary] Error 25
dpkg-buildpackage: error: debian/rules binary subprocess failed with exit status 2
--------------------------------------------------------------------------------
Build finished at 2026-09-15T10:15:49Z

Finished
--------


+------------------------------------------------------------------------------+
| Cleanup                                      Tue, 15 Sep 2026 10:15:49 +0000 |
+------------------------------------------------------------------------------+

Purging /<<BUILDDIR>>
Not cleaning session: cloned chroot in use
E: Build failure (dpkg-buildpackage died with exit 2)

+------------------------------------------------------------------------------+
| Summary                                      Tue, 15 Sep 2026 10:15:50 +0000 |
+------------------------------------------------------------------------------+

Build Architecture: amd64
Build Type: binary
Build-Space: 788
Build-Time: 3
Distribution: sid-unshare
Fail-Stage: build
Host Architecture: amd64
Install-Time: 18
Job: python-darts.lib.utils.lru_0.5-6
Machine Architecture: amd64
Package: python-darts.lib.utils.lru
Package-Time: 29
Source-Version: 0.5-6
Space: 788
Status: attempted
Version: 0.5-6
--------------------------------------------------------------------------------
Finished at 2026-09-15T10:15:49Z
Build needed 00:00:29, 788k disk space
