sbuild (Debian sbuild) 0.89.3+deb13u4 (28 December 2025) on c7a-large-1789467060

+======================================================================================+
| python-xstatic-angular-lrdragndrop 1.0.2.6-6 (amd64) Tue, 15 Sep 2026 10:15:18 +0000 |
+======================================================================================+

Package: python-xstatic-angular-lrdragndrop
Version: 1.0.2.6-6
Source Version: 1.0.2.6-6
Distribution: sid-unshare
Machine Architecture: amd64
Host Architecture: amd64
Build Architecture: amd64
Build Type: binary

I: Unpacking /var/lib/buildd/.cache/sbuild/sid-unshare-amd64.tar.gz to /tmp/tmp.sbuild.47TKItXs7Q...
I: Setting up the chroot...
I: Creating chroot session...
I: Setting up log color...
I: NOTICE: Log filtering will replace 'sbuild-unshare-dummy-location' with '<<CHROOT>>'
I: Setting up apt archive...
I: NOTICE: Log filtering will replace 'build/python-xstatic-angular-lrdragndrop-UQ8EMW/resolver-5nJmrb' with '<<RESOLVERDIR>>'

+------------------------------------------------------------------------------+
| Update chroot                                Tue, 15 Sep 2026 10:15:23 +0000 |
+------------------------------------------------------------------------------+

Get:1 http://deb.debian.org/debian sid InRelease [193 kB]
Get:2 http://deb.debian.org/debian sid/non-free Sources [84.2 kB]
Get:3 http://deb.debian.org/debian sid/main Sources [11.9 MB]
Get:4 http://deb.debian.org/debian sid/non-free-firmware Sources [10.6 kB]
Get:5 http://deb.debian.org/debian sid/contrib Sources [65.0 kB]
Get:6 http://deb.debian.org/debian sid/main amd64 Packages [10.8 MB]
Get:7 http://deb.debian.org/debian sid/non-free amd64 Packages [132 kB]
Get:8 http://deb.debian.org/debian sid/non-free-firmware amd64 Packages [10.8 kB]
Get:9 http://deb.debian.org/debian sid/contrib amd64 Packages [64.1 kB]
Fetched 23.3 MB in 1s (18.5 MB/s)
Reading package lists...
Reading package lists...
Building dependency tree...
Reading state information...
Calculating upgrade...
0 upgraded, 0 newly installed, 0 to remove and 0 not upgraded.

+------------------------------------------------------------------------------+
| Fetch source files                           Tue, 15 Sep 2026 10:15:25 +0000 |
+------------------------------------------------------------------------------+


Check APT
---------

Checking available source versions...

Download source files with APT
------------------------------

Reading package lists...
NOTICE: 'python-xstatic-angular-lrdragndrop' packaging is maintained in the 'Git' version control system at:
https://salsa.debian.org/openstack-team/xstatic/python-xstatic-angular-lrdragndrop.git
Please use:
git clone https://salsa.debian.org/openstack-team/xstatic/python-xstatic-angular-lrdragndrop.git
to retrieve the latest (possibly unreleased) updates to the package.
Need to get 9647 B of source archives.
Get:1 http://deb.debian.org/debian sid/main python-xstatic-angular-lrdragndrop 1.0.2.6-6 (dsc) [2343 B]
Get:2 http://deb.debian.org/debian sid/main python-xstatic-angular-lrdragndrop 1.0.2.6-6 (tar) [4512 B]
Get:3 http://deb.debian.org/debian sid/main python-xstatic-angular-lrdragndrop 1.0.2.6-6 (diff) [2792 B]
Fetched 9647 B in 0s (626 kB/s)
Download complete and in download only mode
I: NOTICE: Log filtering will replace 'build/python-xstatic-angular-lrdragndrop-UQ8EMW/python-xstatic-angular-lrdragndrop-1.0.2.6' with '<<PKGBUILDDIR>>'
I: NOTICE: Log filtering will replace 'build/python-xstatic-angular-lrdragndrop-UQ8EMW' with '<<BUILDDIR>>'

+------------------------------------------------------------------------------+
| Install package build dependencies           Tue, 15 Sep 2026 10:15:25 +0000 |
+------------------------------------------------------------------------------+


Setup apt archive
-----------------

Merged Build-Depends: debhelper-compat (= 11), dh-python, openstack-pkg-tools (>= 75~), python3-all, python3-setuptools, build-essential
Merged Build-Conflicts: python3-xstatic
Filtered Build-Depends: debhelper-compat (= 11), dh-python, openstack-pkg-tools (>= 75~), python3-all, python3-setuptools, build-essential
Filtered Build-Conflicts: python3-xstatic
dpkg-deb: building package 'sbuild-build-depends-main-dummy' in '/<<RESOLVERDIR>>/apt_archive/sbuild-build-depends-main-dummy.deb'.
Ign:1 copy:/<<RESOLVERDIR>>/apt_archive ./ InRelease
Get:2 copy:/<<RESOLVERDIR>>/apt_archive ./ Release [609 B]
Ign:3 copy:/<<RESOLVERDIR>>/apt_archive ./ Release.gpg
Get:4 copy:/<<RESOLVERDIR>>/apt_archive ./ Sources [707 B]
Get:5 copy:/<<RESOLVERDIR>>/apt_archive ./ Packages [740 B]
Fetched 2056 B in 0s (0 B/s)
Reading package lists...
Reading package lists...

Install main build dependencies (apt-based resolver)
----------------------------------------------------

Installing build dependencies
Reading package lists...
Building dependency tree...
Reading state information...
Solving dependencies...
The following additional packages will be installed:
  autoconf automake autopoint autotools-dev bsdextrautils ca-certificates
  debhelper dh-autoreconf dh-python dh-strip-nondeterminism dwz file gettext
  gettext-base groff-base intltool-debian jq libarchive-zip-perl
  libdebhelper-perl libelf1t64 libexpat1 libffi8
  libfile-stripnondeterminism-perl libjq1 libmagic-mgc libmagic1t64
  libncursesw6 libonig5 libpipeline1 libpython3-stdlib libpython3.14-minimal
  libpython3.14-stdlib libreadline8t64 libsqlite3-0 libtool libuchardet0
  libunistring5 libxml2-16 m4 man-db media-types netbase openssl
  openstack-pkg-tools po-debconf python3 python3-all python3-autocommand
  python3-jaraco.context python3-jaraco.functools python3-minimal
  python3-more-itertools python3-packaging python3-pip python3-setuptools
  python3-wheel python3-zipp python3.14 python3.14-minimal readline-common
  sensible-utils tzdata
Suggested packages:
  autoconf-archive gnu-standards autoconf-doc dh-make flit python3-build
  python3-installer gettext-doc libasprintf-dev libgettextpo-dev gnulib-l10n
  groff libtool-doc gfortran | fortran95-compiler m4-doc apparmor less
  www-browser libmail-box-perl python3-doc python3-tk python3-venv
  python-setuptools-doc python3.14-venv python3.14-doc binfmt-support
  readline-doc
Recommended packages:
  curl | wget | lynx python3-requests libarchive-cpio-perl libgpm2 libltdl-dev
  autopkgtest madison-lite pristine-tar libmail-sendmail-perl python3-dev
  libjs-sphinxdoc
The following NEW packages will be installed:
  autoconf automake autopoint autotools-dev bsdextrautils ca-certificates
  debhelper dh-autoreconf dh-python dh-strip-nondeterminism dwz file gettext
  gettext-base groff-base intltool-debian jq libarchive-zip-perl
  libdebhelper-perl libelf1t64 libexpat1 libffi8
  libfile-stripnondeterminism-perl libjq1 libmagic-mgc libmagic1t64
  libncursesw6 libonig5 libpipeline1 libpython3-stdlib libpython3.14-minimal
  libpython3.14-stdlib libreadline8t64 libsqlite3-0 libtool libuchardet0
  libunistring5 libxml2-16 m4 man-db media-types netbase openssl
  openstack-pkg-tools po-debconf python3 python3-all python3-autocommand
  python3-jaraco.context python3-jaraco.functools python3-minimal
  python3-more-itertools python3-packaging python3-pip python3-setuptools
  python3-wheel python3-zipp python3.14 python3.14-minimal readline-common
  sbuild-build-depends-main-dummy sensible-utils tzdata
0 upgraded, 63 newly installed, 0 to remove and 0 not upgraded.
Need to get 25.8 MB of archives.
After this operation, 107 MB of additional disk space will be used.
Get:1 copy:/<<RESOLVERDIR>>/apt_archive ./ sbuild-build-depends-main-dummy 0.invalid.0 [912 B]
Get:2 http://deb.debian.org/debian sid/main amd64 libexpat1 amd64 2.8.4-1 [130 kB]
Get:3 http://deb.debian.org/debian sid/main amd64 libpython3.14-minimal amd64 3.14.7-4 [902 kB]
Get:4 http://deb.debian.org/debian sid/main amd64 python3.14-minimal amd64 3.14.7-4 [2713 kB]
Get:5 http://deb.debian.org/debian sid/main amd64 python3-minimal amd64 3.14.7-3 [25.3 kB]
Get:6 http://deb.debian.org/debian sid/main amd64 media-types all 14.0.0 [30.8 kB]
Get:7 http://deb.debian.org/debian sid/main amd64 netbase all 6.6 [10.3 kB]
Get:8 http://deb.debian.org/debian sid/main amd64 tzdata all 2026c-1 [260 kB]
Get:9 http://deb.debian.org/debian sid/main amd64 libffi8 amd64 3.8.0-2 [32.5 kB]
Get:10 http://deb.debian.org/debian sid/main amd64 libncursesw6 amd64 6.6+20260608-2 [137 kB]
Get:11 http://deb.debian.org/debian sid/main amd64 readline-common all 8.3-4 [74.8 kB]
Get:12 http://deb.debian.org/debian sid/main amd64 libreadline8t64 amd64 8.3-4 [181 kB]
Get:13 http://deb.debian.org/debian sid/main amd64 libsqlite3-0 amd64 3.53.4-2 [974 kB]
Get:14 http://deb.debian.org/debian sid/main amd64 libpython3.14-stdlib amd64 3.14.7-4 [2362 kB]
Get:15 http://deb.debian.org/debian sid/main amd64 python3.14 amd64 3.14.7-4 [861 kB]
Get:16 http://deb.debian.org/debian sid/main amd64 libpython3-stdlib amd64 3.14.7-3 [8252 B]
Get:17 http://deb.debian.org/debian sid/main amd64 python3 amd64 3.14.7-3 [26.0 kB]
Get:18 http://deb.debian.org/debian sid/main amd64 sensible-utils all 0.0.26 [27.0 kB]
Get:19 http://deb.debian.org/debian sid/main amd64 openssl amd64 3.6.4-1 [1546 kB]
Get:20 http://deb.debian.org/debian sid/main amd64 ca-certificates all 20260816 [134 kB]
Get:21 http://deb.debian.org/debian sid/main amd64 libmagic-mgc amd64 1:5.47-4 [345 kB]
Get:22 http://deb.debian.org/debian sid/main amd64 libmagic1t64 amd64 1:5.47-4 [111 kB]
Get:23 http://deb.debian.org/debian sid/main amd64 file amd64 1:5.47-4 [43.0 kB]
Get:24 http://deb.debian.org/debian sid/main amd64 gettext-base amd64 1.0-5 [334 kB]
Get:25 http://deb.debian.org/debian sid/main amd64 libuchardet0 amd64 0.0.8-2+b2 [69.0 kB]
Get:26 http://deb.debian.org/debian sid/main amd64 groff-base amd64 1.24.1-1 [1336 kB]
Get:27 http://deb.debian.org/debian sid/main amd64 bsdextrautils amd64 2.42.3-1 [102 kB]
Get:28 http://deb.debian.org/debian sid/main amd64 libpipeline1 amd64 1.5.8-3 [49.2 kB]
Get:29 http://deb.debian.org/debian sid/main amd64 man-db amd64 2.13.1-1 [1469 kB]
Get:30 http://deb.debian.org/debian sid/main amd64 m4 amd64 1.4.21-1 [332 kB]
Get:31 http://deb.debian.org/debian sid/main amd64 autoconf all 2.73-2 [516 kB]
Get:32 http://deb.debian.org/debian sid/main amd64 autotools-dev all 20240727.1+nmu1 [60.0 kB]
Get:33 http://deb.debian.org/debian sid/main amd64 automake all 1:1.19-1 [891 kB]
Get:34 http://deb.debian.org/debian sid/main amd64 autopoint all 1.0-5 [820 kB]
Get:35 http://deb.debian.org/debian sid/main amd64 libdebhelper-perl all 14.4 [77.6 kB]
Get:36 http://deb.debian.org/debian sid/main amd64 libtool all 2.6.2-2 [553 kB]
Get:37 http://deb.debian.org/debian sid/main amd64 dh-autoreconf all 23 [12.7 kB]
Get:38 http://deb.debian.org/debian sid/main amd64 libarchive-zip-perl all 1.68-1 [104 kB]
Get:39 http://deb.debian.org/debian sid/main amd64 libfile-stripnondeterminism-perl all 1.15.1-1 [17.1 kB]
Get:40 http://deb.debian.org/debian sid/main amd64 dh-strip-nondeterminism all 1.15.1-1 [6020 B]
Get:41 http://deb.debian.org/debian sid/main amd64 libelf1t64 amd64 0.196-1 [61.2 kB]
Get:42 http://deb.debian.org/debian sid/main amd64 dwz amd64 0.17-1 [109 kB]
Get:43 http://deb.debian.org/debian sid/main amd64 libunistring5 amd64 1.4.2-1 [480 kB]
Get:44 http://deb.debian.org/debian sid/main amd64 libxml2-16 amd64 2.15.4+dfsg-1 [683 kB]
Get:45 http://deb.debian.org/debian sid/main amd64 gettext amd64 1.0-5 [2704 kB]
Get:46 http://deb.debian.org/debian sid/main amd64 intltool-debian all 0.35.0+20060710.6 [22.9 kB]
Get:47 http://deb.debian.org/debian sid/main amd64 po-debconf all 1.0.22 [216 kB]
Get:48 http://deb.debian.org/debian sid/main amd64 debhelper all 14.4 [944 kB]
Get:49 http://deb.debian.org/debian sid/main amd64 dh-python all 7.20260623 [114 kB]
Get:50 http://deb.debian.org/debian sid/main amd64 libonig5 amd64 6.9.10-1+b1 [192 kB]
Get:51 http://deb.debian.org/debian sid/main amd64 libjq1 amd64 1.8.2-1 [170 kB]
Get:52 http://deb.debian.org/debian sid/main amd64 jq amd64 1.8.2-1 [88.2 kB]
Get:53 http://deb.debian.org/debian sid/main amd64 python3-packaging all 26.2-2 [84.2 kB]
Get:54 http://deb.debian.org/debian sid/main amd64 python3-wheel all 0.47.0-1 [26.9 kB]
Get:55 http://deb.debian.org/debian sid/main amd64 python3-pip all 26.1.2+dfsg-1 [1402 kB]
Get:56 http://deb.debian.org/debian sid/main amd64 openstack-pkg-tools all 144 [101 kB]
Get:57 http://deb.debian.org/debian sid/main amd64 python3-all amd64 3.14.7-3 [984 B]
Get:58 http://deb.debian.org/debian sid/main amd64 python3-autocommand all 2.2.2-4 [13.7 kB]
Get:59 http://deb.debian.org/debian sid/main amd64 python3-jaraco.context all 6.0.1-2 [8184 B]
Get:60 http://deb.debian.org/debian sid/main amd64 python3-more-itertools all 11.1.0-2 [74.5 kB]
Get:61 http://deb.debian.org/debian sid/main amd64 python3-jaraco.functools all 4.1.0-1 [12.0 kB]
Get:62 http://deb.debian.org/debian sid/main amd64 python3-zipp all 3.23.0-1 [11.0 kB]
Get:63 http://deb.debian.org/debian sid/main amd64 python3-setuptools all 84.0.0-2 [560 kB]
Preconfiguring packages ...
Fetched 25.8 MB in 0s (221 MB/s)
Selecting previously unselected package libexpat1:amd64.
(Reading database ... 11906 files and directories currently installed.)
Preparing to unpack .../libexpat1_2.8.4-1_amd64.deb ...
Unpacking libexpat1:amd64 (2.8.4-1) ...
Selecting previously unselected package libpython3.14-minimal:amd64.
Preparing to unpack .../libpython3.14-minimal_3.14.7-4_amd64.deb ...
Unpacking libpython3.14-minimal:amd64 (3.14.7-4) ...
Selecting previously unselected package python3.14-minimal.
Preparing to unpack .../python3.14-minimal_3.14.7-4_amd64.deb ...
Unpacking python3.14-minimal (3.14.7-4) ...
Setting up libpython3.14-minimal:amd64 (3.14.7-4) ...
Setting up libexpat1:amd64 (2.8.4-1) ...
Setting up python3.14-minimal (3.14.7-4) ...
Selecting previously unselected package python3-minimal.
(Reading database ... 12262 files and directories currently installed.)
Preparing to unpack .../00-python3-minimal_3.14.7-3_amd64.deb ...
Unpacking python3-minimal (3.14.7-3) ...
Selecting previously unselected package media-types.
Preparing to unpack .../01-media-types_14.0.0_all.deb ...
Unpacking media-types (14.0.0) ...
Selecting previously unselected package netbase.
Preparing to unpack .../02-netbase_6.6_all.deb ...
Unpacking netbase (6.6) ...
Selecting previously unselected package tzdata.
Preparing to unpack .../03-tzdata_2026c-1_all.deb ...
Unpacking tzdata (2026c-1) ...
Selecting previously unselected package libffi8:amd64.
Preparing to unpack .../04-libffi8_3.8.0-2_amd64.deb ...
Unpacking libffi8:amd64 (3.8.0-2) ...
Selecting previously unselected package libncursesw6:amd64.
Preparing to unpack .../05-libncursesw6_6.6+20260608-2_amd64.deb ...
Unpacking libncursesw6:amd64 (6.6+20260608-2) ...
Selecting previously unselected package readline-common.
Preparing to unpack .../06-readline-common_8.3-4_all.deb ...
Unpacking readline-common (8.3-4) ...
Selecting previously unselected package libreadline8t64:amd64.
Preparing to unpack .../07-libreadline8t64_8.3-4_amd64.deb ...
Adding 'diversion of /lib/x86_64-linux-gnu/libhistory.so.8 to /lib/x86_64-linux-gnu/libhistory.so.8.usr-is-merged by libreadline8t64'
Adding 'diversion of /lib/x86_64-linux-gnu/libhistory.so.8.2 to /lib/x86_64-linux-gnu/libhistory.so.8.2.usr-is-merged by libreadline8t64'
Adding 'diversion of /lib/x86_64-linux-gnu/libreadline.so.8 to /lib/x86_64-linux-gnu/libreadline.so.8.usr-is-merged by libreadline8t64'
Adding 'diversion of /lib/x86_64-linux-gnu/libreadline.so.8.2 to /lib/x86_64-linux-gnu/libreadline.so.8.2.usr-is-merged by libreadline8t64'
Unpacking libreadline8t64:amd64 (8.3-4) ...
Selecting previously unselected package libsqlite3-0:amd64.
Preparing to unpack .../08-libsqlite3-0_3.53.4-2_amd64.deb ...
Unpacking libsqlite3-0:amd64 (3.53.4-2) ...
Selecting previously unselected package libpython3.14-stdlib:amd64.
Preparing to unpack .../09-libpython3.14-stdlib_3.14.7-4_amd64.deb ...
Unpacking libpython3.14-stdlib:amd64 (3.14.7-4) ...
Selecting previously unselected package python3.14.
Preparing to unpack .../10-python3.14_3.14.7-4_amd64.deb ...
Unpacking python3.14 (3.14.7-4) ...
Selecting previously unselected package libpython3-stdlib:amd64.
Preparing to unpack .../11-libpython3-stdlib_3.14.7-3_amd64.deb ...
Unpacking libpython3-stdlib:amd64 (3.14.7-3) ...
Setting up python3-minimal (3.14.7-3) ...
Selecting previously unselected package python3.
(Reading database ... 13308 files and directories currently installed.)
Preparing to unpack .../00-python3_3.14.7-3_amd64.deb ...
Unpacking python3 (3.14.7-3) ...
Selecting previously unselected package sensible-utils.
Preparing to unpack .../01-sensible-utils_0.0.26_all.deb ...
Unpacking sensible-utils (0.0.26) ...
Selecting previously unselected package openssl.
Preparing to unpack .../02-openssl_3.6.4-1_amd64.deb ...
Unpacking openssl (3.6.4-1) ...
Selecting previously unselected package ca-certificates.
Preparing to unpack .../03-ca-certificates_20260816_all.deb ...
Unpacking ca-certificates (20260816) ...
Selecting previously unselected package libmagic-mgc.
Preparing to unpack .../04-libmagic-mgc_1%3a5.47-4_amd64.deb ...
Unpacking libmagic-mgc (1:5.47-4) ...
Selecting previously unselected package libmagic1t64:amd64.
Preparing to unpack .../05-libmagic1t64_1%3a5.47-4_amd64.deb ...
Unpacking libmagic1t64:amd64 (1:5.47-4) ...
Selecting previously unselected package file.
Preparing to unpack .../06-file_1%3a5.47-4_amd64.deb ...
Unpacking file (1:5.47-4) ...
Selecting previously unselected package gettext-base.
Preparing to unpack .../07-gettext-base_1.0-5_amd64.deb ...
Unpacking gettext-base (1.0-5) ...
Selecting previously unselected package libuchardet0:amd64.
Preparing to unpack .../08-libuchardet0_0.0.8-2+b2_amd64.deb ...
Unpacking libuchardet0:amd64 (0.0.8-2+b2) ...
Selecting previously unselected package groff-base.
Preparing to unpack .../09-groff-base_1.24.1-1_amd64.deb ...
Unpacking groff-base (1.24.1-1) ...
Selecting previously unselected package bsdextrautils.
Preparing to unpack .../10-bsdextrautils_2.42.3-1_amd64.deb ...
Unpacking bsdextrautils (2.42.3-1) ...
Selecting previously unselected package libpipeline1:amd64.
Preparing to unpack .../11-libpipeline1_1.5.8-3_amd64.deb ...
Unpacking libpipeline1:amd64 (1.5.8-3) ...
Selecting previously unselected package man-db.
Preparing to unpack .../12-man-db_2.13.1-1_amd64.deb ...
Unpacking man-db (2.13.1-1) ...
Selecting previously unselected package m4.
Preparing to unpack .../13-m4_1.4.21-1_amd64.deb ...
Unpacking m4 (1.4.21-1) ...
Selecting previously unselected package autoconf.
Preparing to unpack .../14-autoconf_2.73-2_all.deb ...
Unpacking autoconf (2.73-2) ...
Selecting previously unselected package autotools-dev.
Preparing to unpack .../15-autotools-dev_20240727.1+nmu1_all.deb ...
Unpacking autotools-dev (20240727.1+nmu1) ...
Selecting previously unselected package automake.
Preparing to unpack .../16-automake_1%3a1.19-1_all.deb ...
Unpacking automake (1:1.19-1) ...
Selecting previously unselected package autopoint.
Preparing to unpack .../17-autopoint_1.0-5_all.deb ...
Unpacking autopoint (1.0-5) ...
Selecting previously unselected package libdebhelper-perl.
Preparing to unpack .../18-libdebhelper-perl_14.4_all.deb ...
Unpacking libdebhelper-perl (14.4) ...
Selecting previously unselected package libtool.
Preparing to unpack .../19-libtool_2.6.2-2_all.deb ...
Unpacking libtool (2.6.2-2) ...
Selecting previously unselected package dh-autoreconf.
Preparing to unpack .../20-dh-autoreconf_23_all.deb ...
Unpacking dh-autoreconf (23) ...
Selecting previously unselected package libarchive-zip-perl.
Preparing to unpack .../21-libarchive-zip-perl_1.68-1_all.deb ...
Unpacking libarchive-zip-perl (1.68-1) ...
Selecting previously unselected package libfile-stripnondeterminism-perl.
Preparing to unpack .../22-libfile-stripnondeterminism-perl_1.15.1-1_all.deb ...
Unpacking libfile-stripnondeterminism-perl (1.15.1-1) ...
Selecting previously unselected package dh-strip-nondeterminism.
Preparing to unpack .../23-dh-strip-nondeterminism_1.15.1-1_all.deb ...
Unpacking dh-strip-nondeterminism (1.15.1-1) ...
Selecting previously unselected package libelf1t64:amd64.
Preparing to unpack .../24-libelf1t64_0.196-1_amd64.deb ...
Unpacking libelf1t64:amd64 (0.196-1) ...
Selecting previously unselected package dwz.
Preparing to unpack .../25-dwz_0.17-1_amd64.deb ...
Unpacking dwz (0.17-1) ...
Selecting previously unselected package libunistring5:amd64.
Preparing to unpack .../26-libunistring5_1.4.2-1_amd64.deb ...
Unpacking libunistring5:amd64 (1.4.2-1) ...
Selecting previously unselected package libxml2-16:amd64.
Preparing to unpack .../27-libxml2-16_2.15.4+dfsg-1_amd64.deb ...
Unpacking libxml2-16:amd64 (2.15.4+dfsg-1) ...
Selecting previously unselected package gettext.
Preparing to unpack .../28-gettext_1.0-5_amd64.deb ...
Unpacking gettext (1.0-5) ...
Selecting previously unselected package intltool-debian.
Preparing to unpack .../29-intltool-debian_0.35.0+20060710.6_all.deb ...
Unpacking intltool-debian (0.35.0+20060710.6) ...
Selecting previously unselected package po-debconf.
Preparing to unpack .../30-po-debconf_1.0.22_all.deb ...
Unpacking po-debconf (1.0.22) ...
Selecting previously unselected package debhelper.
Preparing to unpack .../31-debhelper_14.4_all.deb ...
Unpacking debhelper (14.4) ...
Selecting previously unselected package dh-python.
Preparing to unpack .../32-dh-python_7.20260623_all.deb ...
Unpacking dh-python (7.20260623) ...
Selecting previously unselected package libonig5:amd64.
Preparing to unpack .../33-libonig5_6.9.10-1+b1_amd64.deb ...
Unpacking libonig5:amd64 (6.9.10-1+b1) ...
Selecting previously unselected package libjq1:amd64.
Preparing to unpack .../34-libjq1_1.8.2-1_amd64.deb ...
Unpacking libjq1:amd64 (1.8.2-1) ...
Selecting previously unselected package jq.
Preparing to unpack .../35-jq_1.8.2-1_amd64.deb ...
Unpacking jq (1.8.2-1) ...
Selecting previously unselected package python3-packaging.
Preparing to unpack .../36-python3-packaging_26.2-2_all.deb ...
Unpacking python3-packaging (26.2-2) ...
Selecting previously unselected package python3-wheel.
Preparing to unpack .../37-python3-wheel_0.47.0-1_all.deb ...
Unpacking python3-wheel (0.47.0-1) ...
Selecting previously unselected package python3-pip.
Preparing to unpack .../38-python3-pip_26.1.2+dfsg-1_all.deb ...
Unpacking python3-pip (26.1.2+dfsg-1) ...
Selecting previously unselected package openstack-pkg-tools.
Preparing to unpack .../39-openstack-pkg-tools_144_all.deb ...
Unpacking openstack-pkg-tools (144) ...
Selecting previously unselected package python3-all.
Preparing to unpack .../40-python3-all_3.14.7-3_amd64.deb ...
Unpacking python3-all (3.14.7-3) ...
Selecting previously unselected package python3-autocommand.
Preparing to unpack .../41-python3-autocommand_2.2.2-4_all.deb ...
Unpacking python3-autocommand (2.2.2-4) ...
Selecting previously unselected package python3-jaraco.context.
Preparing to unpack .../42-python3-jaraco.context_6.0.1-2_all.deb ...
Unpacking python3-jaraco.context (6.0.1-2) ...
Selecting previously unselected package python3-more-itertools.
Preparing to unpack .../43-python3-more-itertools_11.1.0-2_all.deb ...
Unpacking python3-more-itertools (11.1.0-2) ...
Selecting previously unselected package python3-jaraco.functools.
Preparing to unpack .../44-python3-jaraco.functools_4.1.0-1_all.deb ...
Unpacking python3-jaraco.functools (4.1.0-1) ...
Selecting previously unselected package python3-zipp.
Preparing to unpack .../45-python3-zipp_3.23.0-1_all.deb ...
Unpacking python3-zipp (3.23.0-1) ...
Selecting previously unselected package python3-setuptools.
Preparing to unpack .../46-python3-setuptools_84.0.0-2_all.deb ...
Unpacking python3-setuptools (84.0.0-2) ...
Selecting previously unselected package sbuild-build-depends-main-dummy.
Preparing to unpack .../47-sbuild-build-depends-main-dummy_0.invalid.0_amd64.deb ...
Unpacking sbuild-build-depends-main-dummy (0.invalid.0) ...
Setting up media-types (14.0.0) ...
Setting up libpipeline1:amd64 (1.5.8-3) ...
Setting up bsdextrautils (2.42.3-1) ...
Setting up libmagic-mgc (1:5.47-4) ...
Setting up libarchive-zip-perl (1.68-1) ...
Setting up libxml2-16:amd64 (2.15.4+dfsg-1) ...
Setting up libdebhelper-perl (14.4) ...
Setting up libsqlite3-0:amd64 (3.53.4-2) ...
Setting up libmagic1t64:amd64 (1:5.47-4) ...
Setting up gettext-base (1.0-5) ...
Setting up m4 (1.4.21-1) ...
Setting up file (1:5.47-4) ...
Setting up libelf1t64:amd64 (0.196-1) ...
Setting up tzdata (2026c-1) ...

Current default time zone: 'Etc/UTC'
Local time is now:      Tue Sep 15 10:15:33 UTC 2026.
Universal Time is now:  Tue Sep 15 10:15:33 UTC 2026.
Run 'dpkg-reconfigure tzdata' if you wish to change it.

Setting up autotools-dev (20240727.1+nmu1) ...
Setting up libunistring5:amd64 (1.4.2-1) ...
Setting up autopoint (1.0-5) ...
Setting up libncursesw6:amd64 (6.6+20260608-2) ...
Setting up autoconf (2.73-2) ...
Setting up libffi8:amd64 (3.8.0-2) ...
Setting up dwz (0.17-1) ...
Setting up sensible-utils (0.0.26) ...
Setting up libuchardet0:amd64 (0.0.8-2+b2) ...
Setting up netbase (6.6) ...
Setting up openssl (3.6.4-1) ...
Setting up readline-common (8.3-4) ...
Setting up libonig5:amd64 (6.9.10-1+b1) ...
Setting up automake (1:1.19-1) ...
update-alternatives: using /usr/bin/automake-1.19 to provide /usr/bin/automake (automake) in auto mode
Setting up libfile-stripnondeterminism-perl (1.15.1-1) ...
Setting up gettext (1.0-5) ...
Setting up libtool (2.6.2-2) ...
Setting up libjq1:amd64 (1.8.2-1) ...
Setting up intltool-debian (0.35.0+20060710.6) ...
Setting up dh-autoreconf (23) ...
Setting up ca-certificates (20260816) ...
Updating certificates in /etc/ssl/certs...
121 added, 0 removed; done.
Setting up libreadline8t64:amd64 (8.3-4) ...
Setting up dh-strip-nondeterminism (1.15.1-1) ...
Setting up groff-base (1.24.1-1) ...
Setting up jq (1.8.2-1) ...
Setting up libpython3.14-stdlib:amd64 (3.14.7-4) ...
Setting up po-debconf (1.0.22) ...
Setting up man-db (2.13.1-1) ...
Not building database; man-db/auto-update is not 'true'.
Setting up python3.14 (3.14.7-4) ...
Setting up libpython3-stdlib:amd64 (3.14.7-3) ...
Setting up debhelper (14.4) ...
Setting up python3 (3.14.7-3) ...
Setting up python3-zipp (3.23.0-1) ...
Setting up python3-autocommand (2.2.2-4) ...
Setting up python3-packaging (26.2-2) ...
Setting up dh-python (7.20260623) ...
Setting up python3-more-itertools (11.1.0-2) ...
Setting up python3-jaraco.functools (4.1.0-1) ...
Setting up python3-jaraco.context (6.0.1-2) ...
Setting up python3-all (3.14.7-3) ...
Setting up python3-wheel (0.47.0-1) ...
Setting up python3-pip (26.1.2+dfsg-1) ...
Setting up python3-setuptools (84.0.0-2) ...
Setting up openstack-pkg-tools (144) ...
Setting up sbuild-build-depends-main-dummy (0.invalid.0) ...
Processing triggers for libc-bin (2.43-5) ...
Processing triggers for ca-certificates (20260816) ...
Updating certificates in /etc/ssl/certs...
0 added, 0 removed; done.
Running hooks in /etc/ca-certificates/update.d...
done.

+------------------------------------------------------------------------------+
| Check architectures                          Tue, 15 Sep 2026 10:15:38 +0000 |
+------------------------------------------------------------------------------+

Arch check ok (amd64 included in all)

+------------------------------------------------------------------------------+
| Build environment                            Tue, 15 Sep 2026 10:15:39 +0000 |
+------------------------------------------------------------------------------+

Kernel: Linux 6.12.107+deb13-cloud-amd64 #1 SMP PREEMPT_DYNAMIC Debian 6.12.107-1 (2026-08-29) amd64 (x86_64)
Toolchain package versions: binutils_2.47-6 dpkg-dev_1.23.11 g++-16_16.2.0-2 gcc-16_16.2.0-2 libc6-dev_2.43-5 libstdc++-16-dev_16.2.0-2 libstdc++6_16.2.0-2 linux-libc-dev_7.1.13-1
Package versions: apt_3.3.3 autoconf_2.73-2 automake_1:1.19-1 autopoint_1.0-5 autotools-dev_20240727.1+nmu1 base-files_14.2 base-passwd_3.6.8 bash_5.3-4 binutils_2.47-6 binutils-common_2.47-6 binutils-x86-64-linux-gnu_2.47-6 bsdextrautils_2.42.3-1 build-essential_12.12 bzip2_1.0.8-6+b2 ca-certificates_20260816 coreutils_9.10-1 cpp_4:16.1.0-3 cpp-16_16.2.0-2 cpp-16-x86-64-linux-gnu_16.2.0-2 cpp-x86-64-linux-gnu_4:16.1.0-3 dash_0.5.12-12 debconf_1.5.92 debhelper_14.4 debian-archive-keyring_2025.1 debianutils_5.24 dh-autoreconf_23 dh-python_7.20260623 dh-strip-nondeterminism_1.15.1-1 diffutils_1:3.12-1 dpkg_1.23.11 dpkg-dev_1.23.11 dwz_0.17-1 file_1:5.47-4 findutils_4.11.0-2 g++_4:16.1.0-3 g++-16_16.2.0-2 g++-16-x86-64-linux-gnu_16.2.0-2 g++-x86-64-linux-gnu_4:16.1.0-3 gcc_4:16.1.0-3 gcc-16_16.2.0-2 gcc-16-base_16.2.0-2 gcc-16-x86-64-linux-gnu_16.2.0-2 gcc-x86-64-linux-gnu_4:16.1.0-3 gettext_1.0-5 gettext-base_1.0-5 grep_3.12-1 groff-base_1.24.1-1 gzip_1.14-1 hostname_3.25 init-system-helpers_1.69+nmu1 intltool-debian_0.35.0+20060710.6 jq_1.8.2-1 libacl1_2.4.0-1 libapt-pkg7.0_3.3.3 libarchive-zip-perl_1.68-1 libasan8_16.2.0-2 libatomic1_16.2.0-2 libattr1_1:2.6.0-1 libaudit-common_1:4.1.2-1 libaudit1_1:4.1.2-1+b2 libbinutils_2.47-6 libblkid1_2.42.3-1 libbz2-1.0_1.0.8-6+b2 libc-bin_2.43-5 libc-dev-bin_2.43-5 libc-gconv-modules-extra_2.43-5 libc6_2.43-5 libc6-dev_2.43-5 libcap-ng0_0.9.6-1 libcc1-0_16.2.0-2 libcrypt1_1:4.5.2+20251210-1 libctf-nobfd0_2.47-6 libctf0_2.47-6 libdb5.3t64_5.3.28+dfsg2-11+b1 libdebconfclient0_0.283 libdebhelper-perl_14.4 libdpkg-perl_1.23.11 libelf1t64_0.196-1 libexpat1_2.8.4-1 libffi8_3.8.0-2 libfile-stripnondeterminism-perl_1.15.1-1 libgcc-16-dev_16.2.0-2 libgcc-s1_16.2.0-2 libgdbm-compat4t64_1.26-1+b2 libgdbm6t64_1.26-1+b2 libgmp10_2:6.3.0+dfsg-5+b2 libgomp1_16.2.0-2 libgprofng0_2.47-6 libhogweed6t64_3.10.2-1+b1 libhwasan0_16.2.0-2 libisl23_0.28-1 libitm1_16.2.0-2 libjansson4_2.15.1-1 libjq1_1.8.2-1 liblsan0_16.2.0-2 liblz4-1_1.10.0-10 liblzma5_5.8.4-1 libmagic-mgc_1:5.47-4 libmagic1t64_1:5.47-4 libmd0_1.2.0-2 libmount1_2.42.3-1 libmpc3_1.3.1-3 libmpfr6_4.2.2-3 libncursesw6_6.6+20260608-2 libnettle8t64_3.10.2-1+b1 libonig5_6.9.10-1+b1 libpam-modules_1.7.0-8 libpam-modules-bin_1.7.0-8 libpam-runtime_1.7.0-8 libpam0g_1.7.0-8 libpcre2-8-0_10.48-3 libperl5.42_5.42.3-1 libpipeline1_1.5.8-3 libpython3-stdlib_3.14.7-3 libpython3.14-minimal_3.14.7-4 libpython3.14-stdlib_3.14.7-4 libquadmath0_16.2.0-2 libreadline8t64_8.3-4 libseccomp2_2.6.1-1+b1 libselinux1_3.11-2 libsframe3_2.47-6 libsmartcols1_2.42.3-1 libsqlite3-0_3.53.4-2 libssl3t64_3.6.4-1 libstdc++-16-dev_16.2.0-2 libstdc++6_16.2.0-2 libsystemd0_262~rc2-1 libtinfo6_6.6+20260608-2 libtool_2.6.2-2 libtsan2_16.2.0-2 libubsan1_16.2.0-2 libuchardet0_0.0.8-2+b2 libudev1_262~rc2-1 libunistring5_1.4.2-1 libuuid1_2.42.3-1 libxml2-16_2.15.4+dfsg-1 libxxhash0_0.8.3-2+b2 libzstd1_1.5.7+dfsg-4 linux-libc-dev_7.1.13-1 m4_1.4.21-1 make_4.4.1-3 man-db_2.13.1-1 mawk_1.3.4.20260302-1 media-types_14.0.0 ncurses-base_6.6+20260608-2 ncurses-bin_6.6+20260608-2 netbase_6.6 openssl_3.6.4-1 openssl-provider-legacy_3.6.4-1 openstack-pkg-tools_144 patch_2.8-2 perl_5.42.3-1 perl-base_5.42.3-1 perl-modules-5.42_5.42.3-1 po-debconf_1.0.22 python3_3.14.7-3 python3-all_3.14.7-3 python3-autocommand_2.2.2-4 python3-jaraco.context_6.0.1-2 python3-jaraco.functools_4.1.0-1 python3-minimal_3.14.7-3 python3-more-itertools_11.1.0-2 python3-packaging_26.2-2 python3-pip_26.1.2+dfsg-1 python3-setuptools_84.0.0-2 python3-wheel_0.47.0-1 python3-zipp_3.23.0-1 python3.14_3.14.7-4 python3.14-minimal_3.14.7-4 readline-common_8.3-4 sbuild-build-depends-main-dummy_0.invalid.0 sed_4.9-3 sensible-utils_0.0.26 sqv_1.5.0-1 sysvinit-utils_3.18-1 tar_1.35+dfsg-5 tzdata_2026c-1 util-linux_2.42.3-1 xz-utils_5.8.4-1 zlib1g_1:1.3.dfsg+really1.3.2-3

+------------------------------------------------------------------------------+
| Build                                        Tue, 15 Sep 2026 10:15:39 +0000 |
+------------------------------------------------------------------------------+


Unpack source
-------------

-----BEGIN PGP SIGNED MESSAGE-----
Hash: SHA512

Format: 3.0 (quilt)
Source: python-xstatic-angular-lrdragndrop
Binary: python3-xstatic-angular-lrdragndrop
Architecture: all
Version: 1.0.2.6-6
Maintainer: Debian OpenStack <team+openstack@tracker.debian.org>
Uploaders: Thomas Goirand <zigo@debian.org>
Homepage: https://github.com/openstack/XStatic-Angular-lrdragndrop
Standards-Version: 4.1.3
Vcs-Browser: https://salsa.debian.org/openstack-team/xstatic/python-xstatic-angular-lrdragndrop
Vcs-Git: https://salsa.debian.org/openstack-team/xstatic/python-xstatic-angular-lrdragndrop.git
Build-Depends: debhelper-compat (= 11), dh-python, openstack-pkg-tools (>= 75~), python3-all, python3-setuptools
Build-Conflicts: python3-xstatic
Package-List:
 python3-xstatic-angular-lrdragndrop deb python optional arch=all
Checksums-Sha1:
 c81cc61d2caaa75d9f101dd7c85ba25d9f42e962 4512 python-xstatic-angular-lrdragndrop_1.0.2.6.orig.tar.xz
 7f827a386e298484b9a62d2604066ff03f842fd8 2792 python-xstatic-angular-lrdragndrop_1.0.2.6-6.debian.tar.xz
Checksums-Sha256:
 b7f4a3aa0317e6e96b5e34c7639a35bcf9800ecb2e0323fae9ee470ba7a1de33 4512 python-xstatic-angular-lrdragndrop_1.0.2.6.orig.tar.xz
 3fbed76adaf4c844437e3a32137802af12b13e03d4a37d375d413226122b4d80 2792 python-xstatic-angular-lrdragndrop_1.0.2.6-6.debian.tar.xz
Files:
 3a4ed851064e1d4c869de5cbe9e70242 4512 python-xstatic-angular-lrdragndrop_1.0.2.6.orig.tar.xz
 884d0e5c164ef17d27b151875beba241 2792 python-xstatic-angular-lrdragndrop_1.0.2.6-6.debian.tar.xz

-----BEGIN PGP SIGNATURE-----

iQIzBAEBCgAdFiEEoLGp81CJVhMOekJc1BatFaxrQ/4FAmqatjEACgkQ1BatFaxr
Q/5RAQ//WDzDWkC8do8/XETamvZaoq/21qZBHrbhrLvej7hItckGYxiirwEGonWf
NFuLDXOoR7HulFPYGgb+//l/YlzemWzAJgudWty3MNOHbuMEzQ6IfzbUuZKHQctB
F/WRNgzD61nxC2Etm86bRvxJb9jmjgrkJkVUH8GytUKxQ8trZkgpUY87zhP9YZTa
4aZz4rsqeQhqIVYyYNqhpVdTx9nSCtVk4becQi1Y/Et9k6Sq0mwzHMKC4QldojYw
jNBW4Otrqx6VqCz0Em4BKBVq+okLSIzBTs1ev5lxTVYlCRKQfwcv2hvqQqf9HwlC
WUUw6YSWnF+mOoGt0SCuhb6Cir/VGWDDSGLchwDFfr5n4ZkflN8b8soG52RrEN7H
WDhhJ1nQGsnGf+v60jmNftuScUEajaKJZrw+N8Hvb+/aiZKzKzISGLucsiu49YNg
WLU9B3S61YpbXvK2yFmRsfkscfdrMfDEF7ObYtDa3PXCnRXU4aVBO0jM1sRy5DYh
ahGARVpTAEv1M6K2Vm67SBwl3wXInUhzrtY9CC40ppLDSlEu7u5MlinmTfAAlLJI
NnYH8EYUBC5hFXR7lxAQFsHtJtGo+cc8gAPAOh3V+Z2T8MwBz+1ygrZeWnUvT8ER
g96lP2giQr8LsZlmJmJGBwzJ7W0XXlkXJ6BQjvR4VWl1ZsjXi7s=
=6jfm
-----END PGP SIGNATURE-----

dpkg-source: warning: cannot verify inline signature for ./python-xstatic-angular-lrdragndrop_1.0.2.6-6.dsc: missing OpenPGP keyrings
dpkg-source: info: verifying ./python-xstatic-angular-lrdragndrop_1.0.2.6-6.dsc
dpkg-source: info: skipping absent keyring /usr/share/keyrings/debian-keyring.pgp
dpkg-source: info: skipping absent keyring /usr/share/keyrings/debian-tag2upload.pgp
dpkg-source: info: skipping absent keyring /usr/share/keyrings/debian-nonupload.pgp
dpkg-source: info: skipping absent keyring /usr/share/keyrings/debian-maintainers.pgp
dpkg-source: info: extracting python-xstatic-angular-lrdragndrop in /<<PKGBUILDDIR>>
dpkg-source: info: unpacking python-xstatic-angular-lrdragndrop_1.0.2.6.orig.tar.xz
dpkg-source: info: unpacking python-xstatic-angular-lrdragndrop_1.0.2.6-6.debian.tar.xz

Check disk space
----------------

Sufficient free space for build

User Environment
----------------

APT_CONFIG=/var/lib/sbuild/apt.conf
DEB_BUILD_OPTIONS=parallel=2
HOME=/sbuild-nonexistent
LC_ALL=C.UTF-8
LOGNAME=sbuild
PATH=/usr/local/sbin:/usr/local/bin:/usr/sbin:/usr/bin:/sbin:/bin:/usr/games
SHELL=/bin/sh
USER=sbuild

dpkg-buildpackage
-----------------

Command: dpkg-buildpackage --sanitize-env -us -uc -b
dpkg-buildpackage: info: source package python-xstatic-angular-lrdragndrop
dpkg-buildpackage: info: source version 1.0.2.6-6
dpkg-buildpackage: info: source distribution unstable
dpkg-buildpackage: info: source changed by Thomas Goirand <zigo@debian.org>
 dpkg-source --before-build .
dpkg-buildpackage: info: host architecture amd64
dpkg-source: info: using options from /<<PKGBUILDDIR>>/debian/source/options: --extend-diff-ignore=^[^/]*[.]egg-info/
 debian/rules clean
make: pyversions: No such file or directory
py3versions: no X-Python3-Version in control file, using supported versions
dh clean --buildsystem=pybuild --with python3
   debian/rules override_dh_auto_clean
make[1]: Entering directory '/<<PKGBUILDDIR>>'
make[1]: pyversions: No such file or directory
py3versions: no X-Python3-Version in control file, using supported versions
rm -rf build .stestr *.egg-info .pybuild
find . -iname '*.pyc' -delete
for i in $(find . -type d -iname __pycache__) ; do rm -rf $i ; done
make[1]: Leaving directory '/<<PKGBUILDDIR>>'
   dh_autoreconf_clean -O--buildsystem=pybuild
   debian/rules override_dh_clean
make[1]: Entering directory '/<<PKGBUILDDIR>>'
make[1]: pyversions: No such file or directory
py3versions: no X-Python3-Version in control file, using supported versions
dh_clean
rm -rf build
make[1]: Leaving directory '/<<PKGBUILDDIR>>'
 debian/rules binary
make: pyversions: No such file or directory
py3versions: no X-Python3-Version in control file, using supported versions
dh binary --buildsystem=pybuild --with python3
   dh_update_autotools_config -O--buildsystem=pybuild
   dh_autoreconf -O--buildsystem=pybuild
   dh_auto_configure -O--buildsystem=pybuild
I: pybuild base:385: python3.14 setup.py config 
Traceback (most recent call last):
  File "/<<PKGBUILDDIR>>/setup.py", line 2, in <module>
    from xstatic.pkg import angular_lrdragndrop as xs
  File "/<<PKGBUILDDIR>>/xstatic/__init__.py", line 1, in <module>
    __import__('pkg_resources').declare_namespace(__name__)
    ~~~~~~~~~~^^^^^^^^^^^^^^^^^
ModuleNotFoundError: No module named 'pkg_resources'
E: pybuild pybuild:485: configure: plugin distutils failed with: exit code=1: python3.14 setup.py config 
dh_auto_configure: error: pybuild --configure -i python{version} -p 3.14 --parallel=2 returned exit code 13
make: *** [debian/rules:7: binary] Error 25
dpkg-buildpackage: error: debian/rules binary subprocess failed with exit status 2
--------------------------------------------------------------------------------
Build finished at 2026-09-15T10:15:41Z

Finished
--------


+------------------------------------------------------------------------------+
| Cleanup                                      Tue, 15 Sep 2026 10:15:41 +0000 |
+------------------------------------------------------------------------------+

Purging /<<BUILDDIR>>
Not cleaning session: cloned chroot in use
E: Build failure (dpkg-buildpackage died with exit 2)

+------------------------------------------------------------------------------+
| Summary                                      Tue, 15 Sep 2026 10:15:42 +0000 |
+------------------------------------------------------------------------------+

Build Architecture: amd64
Build Type: binary
Build-Space: 140
Build-Time: 2
Distribution: sid-unshare
Fail-Stage: build
Host Architecture: amd64
Install-Time: 13
Job: python-xstatic-angular-lrdragndrop_1.0.2.6-6
Machine Architecture: amd64
Package: python-xstatic-angular-lrdragndrop
Package-Time: 23
Source-Version: 1.0.2.6-6
Space: 140
Status: attempted
Version: 1.0.2.6-6
--------------------------------------------------------------------------------
Finished at 2026-09-15T10:15:41Z
Build needed 00:00:23, 140k disk space
