sbuild (Debian sbuild) 0.81.2+deb11u1 (31 August 2022) on ip-10-1-14-46.us-west-2.compute.internal

+=================================================================================+
| ruby-graphviz 1.2.5-2+rebuild1663007659 (amd64) Mon, 12 Sep 2022 18:34:20 +0000 |
+=================================================================================+

Package: ruby-graphviz
Version: 1.2.5-2+rebuild1663007659
Source Version: 1.2.5-2+rebuild1663007659
Distribution: experimental
Machine Architecture: amd64
Host Architecture: amd64
Build Architecture: amd64
Build Type: binary

I: NOTICE: Log filtering will replace 'var/run/schroot/mount/experimental-amd64-mass-rebuild-ace6254a-e314-43bb-86dd-d96c1677c778' with '<<CHROOT>>'
I: NOTICE: Log filtering will replace 'build/ruby-graphviz-DOvkqK/resolver-vMzO94' with '<<RESOLVERDIR>>'

+------------------------------------------------------------------------------+
| Update chroot                                                                |
+------------------------------------------------------------------------------+

Get:1 file:/var/mass-rebuild ./ InRelease
Ign:1 file:/var/mass-rebuild ./ InRelease
Get:2 file:/var/mass-rebuild ./ Release [1617 B]
Get:2 file:/var/mass-rebuild ./ Release [1617 B]
Get:3 file:/var/mass-rebuild ./ Release.gpg
Ign:3 file:/var/mass-rebuild ./ Release.gpg
Hit:4 http://cdn-aws.deb.debian.org/debian unstable InRelease
Hit:5 http://cdn-aws.deb.debian.org/debian experimental InRelease
Hit:6 http://incoming.debian.org/debian-buildd buildd-unstable InRelease
Reading package lists...
Reading package lists...
Building dependency tree...
Reading state information...
Calculating upgrade...
0 upgraded, 0 newly installed, 0 to remove and 0 not upgraded.

+------------------------------------------------------------------------------+
| Fetch source files                                                           |
+------------------------------------------------------------------------------+


Local sources
-------------

/home/admin/mass-rebuild/builds/17/ruby-graphviz/ruby-graphviz_1.2.5-2+rebuild1663007659.dsc exists in /home/admin/mass-rebuild/builds/17/ruby-graphviz; copying to chroot
I: NOTICE: Log filtering will replace 'build/ruby-graphviz-DOvkqK/ruby-graphviz-1.2.5' with '<<PKGBUILDDIR>>'
I: NOTICE: Log filtering will replace 'build/ruby-graphviz-DOvkqK' with '<<BUILDDIR>>'

+------------------------------------------------------------------------------+
| Install package build dependencies                                           |
+------------------------------------------------------------------------------+


Setup apt archive
-----------------

Merged Build-Depends: debhelper-compat (= 12), gem2deb, graphviz, build-essential, fakeroot
Filtered Build-Depends: debhelper-compat (= 12), gem2deb, graphviz, build-essential, fakeroot
dpkg-deb: building package 'sbuild-build-depends-main-dummy' in '/<<RESOLVERDIR>>/apt_archive/sbuild-build-depends-main-dummy.deb'.
Ign:1 copy:/<<RESOLVERDIR>>/apt_archive ./ InRelease
Get:2 copy:/<<RESOLVERDIR>>/apt_archive ./ Release [957 B]
Ign:3 copy:/<<RESOLVERDIR>>/apt_archive ./ Release.gpg
Get:4 copy:/<<RESOLVERDIR>>/apt_archive ./ Sources [383 B]
Get:5 copy:/<<RESOLVERDIR>>/apt_archive ./ Packages [466 B]
Fetched 1806 B in 0s (177 kB/s)
Reading package lists...
Reading package lists...

Install main build dependencies (apt-based resolver)
----------------------------------------------------

Installing build dependencies
Reading package lists...
Building dependency tree...
Reading state information...
The following additional packages will be installed:
  autoconf automake autopoint autotools-dev bsdextrautils debhelper devscripts
  dh-autoreconf dh-strip-nondeterminism dirmngr dwz file fontconfig
  fontconfig-config fonts-dejavu-core gem2deb gem2deb-test-runner gettext
  gettext-base gnupg gnupg-l10n gnupg-utils gpg gpg-agent gpg-wks-client
  gpg-wks-server gpgconf gpgsm graphviz groff-base intltool-debian libann0
  libarchive-zip-perl libassuan0 libb-hooks-op-check-perl libbrotli1 libcairo2
  libcdt5 libcgraph6 libclass-method-modifiers-perl libclass-xsaccessor-perl
  libdatrie1 libdebhelper-perl libdeflate0 libdevel-callchecker-perl
  libdynaloader-functions-perl libelf1 libencode-locale-perl libexpat1
  libfile-dirlist-perl libfile-homedir-perl libfile-listing-perl
  libfile-stripnondeterminism-perl libfile-touch-perl libfile-which-perl
  libfontconfig1 libfreetype6 libfribidi0 libgd3 libglib2.0-0 libgraphite2-3
  libgts-0.7-5 libgvc6 libgvpr2 libharfbuzz0b libhtml-parser-perl
  libhtml-tagset-perl libhtml-tree-perl libhttp-cookies-perl libhttp-date-perl
  libhttp-message-perl libhttp-negotiate-perl libice6 libicu71
  libimport-into-perl libio-html-perl libio-pty-perl libio-socket-ssl-perl
  libipc-run-perl libjbig0 libjpeg62-turbo libksba8 liblab-gamut1
  libldap-2.5-0 liblerc4 libltdl7 liblwp-mediatypes-perl
  liblwp-protocol-https-perl libmagic-mgc libmagic1 libmodule-runtime-perl
  libmoo-perl libmpdec3 libncursesw6 libnet-http-perl libnet-ssleay-perl
  libnpth0 libpango-1.0-0 libpangocairo-1.0-0 libpangoft2-1.0-0
  libparams-classify-perl libpathplan4 libpipeline1 libpixman-1-0 libpng16-16
  libpython3-stdlib libpython3.10-minimal libpython3.10-stdlib libreadline8
  libregexp-ipv6-perl librole-tiny-perl libsasl2-2 libsasl2-modules-db libsm6
  libsqlite3-0 libsub-override-perl libsub-quote-perl libthai-data libthai0
  libtiff5 libtimedate-perl libtool libtry-tiny-perl libuchardet0 liburi-perl
  libwebp7 libwww-perl libwww-robotrules-perl libx11-6 libx11-data libxau6
  libxaw7 libxcb-render0 libxcb-shm0 libxcb1 libxdmcp6 libxext6 libxml2
  libxmu6 libxpm4 libxrender1 libxt6 m4 man-db media-types netbase patchutils
  perl-openssl-defaults pinentry-curses po-debconf python3 python3-minimal
  python3.10 python3.10-minimal readline-common sensible-utils ucf wdiff
  x11-common
Suggested packages:
  autoconf-archive gnu-standards autoconf-doc dh-make adequate at autopkgtest
  bls-standalone bsd-mailx | mailx check-all-the-things cvs-buildpackage
  diffoscope disorderfs dose-extra duck elpa-devscripts faketime gnuplot
  how-can-i-help libauthen-sasl-perl libdbd-pg-perl libfile-desktopentry-perl
  libnet-smtps-perl libterm-size-perl libyaml-syck-perl mmdebstrap
  mozilla-devscripts mutt piuparts postgresql-client pristine-lfs quilt ratt
  reprotest ssh-client svn-buildpackage w3m dbus-user-session libpam-systemd
  pinentry-gnome3 tor git-buildpackage pristine-tar gettext-doc
  libasprintf-dev libgettextpo-dev parcimonie xloadimage scdaemon gsfonts
  graphviz-doc groff libgd-tools libdata-dump-perl libcrypt-ssleay-perl
  libscalar-number-perl libtool-doc gfortran | fortran95-compiler gcj-jdk
  libsub-name-perl libbusiness-isbn-perl libauthen-ntlm-perl m4-doc apparmor
  less www-browser pinentry-doc libmail-box-perl python3-doc python3-tk
  python3-venv python3.10-venv python3.10-doc binfmt-support readline-doc
  wdiff-doc
Recommended packages:
  dctrl-tools dput | dupload libdistro-info-perl libgit-wrapper-perl
  libgitlab-api-v4-perl liblist-compare-perl libstring-shellquote-perl
  licensecheck lintian python3-apt python3-debian python3-magic
  python3-requests python3-unidiff python3-xdg strace unzip wget | curl
  debian-keyring equivs libsoap-lite-perl pristine-tar apt-file curl | wget
  | lynx fonts-liberation2 libarchive-cpio-perl libglib2.0-data
  shared-mime-info xdg-user-dirs libgts-bin libhtml-format-perl libclone-perl
  libldap-common libnamespace-clean-perl libgpm2 libsasl2-modules libltdl-dev
  libdata-dump-perl libhtml-form-perl libhttp-daemon-perl libmailtools-perl
  libmail-sendmail-perl
The following NEW packages will be installed:
  autoconf automake autopoint autotools-dev bsdextrautils debhelper devscripts
  dh-autoreconf dh-strip-nondeterminism dirmngr dwz file fontconfig
  fontconfig-config fonts-dejavu-core gem2deb gem2deb-test-runner gettext
  gettext-base gnupg gnupg-l10n gnupg-utils gpg gpg-agent gpg-wks-client
  gpg-wks-server gpgconf gpgsm graphviz groff-base intltool-debian libann0
  libarchive-zip-perl libassuan0 libb-hooks-op-check-perl libbrotli1 libcairo2
  libcdt5 libcgraph6 libclass-method-modifiers-perl libclass-xsaccessor-perl
  libdatrie1 libdebhelper-perl libdeflate0 libdevel-callchecker-perl
  libdynaloader-functions-perl libelf1 libencode-locale-perl libexpat1
  libfile-dirlist-perl libfile-homedir-perl libfile-listing-perl
  libfile-stripnondeterminism-perl libfile-touch-perl libfile-which-perl
  libfontconfig1 libfreetype6 libfribidi0 libgd3 libglib2.0-0 libgraphite2-3
  libgts-0.7-5 libgvc6 libgvpr2 libharfbuzz0b libhtml-parser-perl
  libhtml-tagset-perl libhtml-tree-perl libhttp-cookies-perl libhttp-date-perl
  libhttp-message-perl libhttp-negotiate-perl libice6 libicu71
  libimport-into-perl libio-html-perl libio-pty-perl libio-socket-ssl-perl
  libipc-run-perl libjbig0 libjpeg62-turbo libksba8 liblab-gamut1
  libldap-2.5-0 liblerc4 libltdl7 liblwp-mediatypes-perl
  liblwp-protocol-https-perl libmagic-mgc libmagic1 libmodule-runtime-perl
  libmoo-perl libmpdec3 libncursesw6 libnet-http-perl libnet-ssleay-perl
  libnpth0 libpango-1.0-0 libpangocairo-1.0-0 libpangoft2-1.0-0
  libparams-classify-perl libpathplan4 libpipeline1 libpixman-1-0 libpng16-16
  libpython3-stdlib libpython3.10-minimal libpython3.10-stdlib libreadline8
  libregexp-ipv6-perl librole-tiny-perl libsasl2-2 libsasl2-modules-db libsm6
  libsqlite3-0 libsub-override-perl libsub-quote-perl libthai-data libthai0
  libtiff5 libtimedate-perl libtool libtry-tiny-perl libuchardet0 liburi-perl
  libwebp7 libwww-perl libwww-robotrules-perl libx11-6 libx11-data libxau6
  libxaw7 libxcb-render0 libxcb-shm0 libxcb1 libxdmcp6 libxext6 libxml2
  libxmu6 libxpm4 libxrender1 libxt6 m4 man-db media-types netbase patchutils
  perl-openssl-defaults pinentry-curses po-debconf python3 python3-minimal
  python3.10 python3.10-minimal readline-common
  sbuild-build-depends-main-dummy sensible-utils ucf wdiff x11-common
0 upgraded, 160 newly installed, 0 to remove and 0 not upgraded.
Need to get 51.8 MB of archives.
After this operation, 158 MB of additional disk space will be used.
Get:1 copy:/<<RESOLVERDIR>>/apt_archive ./ sbuild-build-depends-main-dummy 0.invalid.0 [888 B]
Get:2 http://cdn-aws.deb.debian.org/debian unstable/main amd64 libpython3.10-minimal amd64 3.10.7-1 [828 kB]
Get:3 http://cdn-aws.deb.debian.org/debian unstable/main amd64 libexpat1 amd64 2.4.8-1 [109 kB]
Get:4 http://cdn-aws.deb.debian.org/debian unstable/main amd64 python3.10-minimal amd64 3.10.7-1 [1994 kB]
Get:5 http://cdn-aws.deb.debian.org/debian unstable/main amd64 python3-minimal amd64 3.10.6-1 [38.7 kB]
Get:6 http://cdn-aws.deb.debian.org/debian unstable/main amd64 media-types all 8.0.0 [33.4 kB]
Get:7 http://cdn-aws.deb.debian.org/debian unstable/main amd64 libmpdec3 amd64 2.5.1-2 [87.8 kB]
Get:8 http://cdn-aws.deb.debian.org/debian unstable/main amd64 libncursesw6 amd64 6.3+20220423-2 [133 kB]
Get:9 http://cdn-aws.deb.debian.org/debian unstable/main amd64 readline-common all 8.2~rc2-2 [75.8 kB]
Get:10 http://cdn-aws.deb.debian.org/debian unstable/main amd64 libreadline8 amd64 8.2~rc2-2 [173 kB]
Get:11 http://cdn-aws.deb.debian.org/debian unstable/main amd64 libsqlite3-0 amd64 3.39.3-1 [844 kB]
Get:12 http://cdn-aws.deb.debian.org/debian unstable/main amd64 libpython3.10-stdlib amd64 3.10.7-1 [1685 kB]
Get:13 http://cdn-aws.deb.debian.org/debian unstable/main amd64 python3.10 amd64 3.10.7-1 [547 kB]
Get:14 http://cdn-aws.deb.debian.org/debian unstable/main amd64 libpython3-stdlib amd64 3.10.6-1 [21.7 kB]
Get:15 http://cdn-aws.deb.debian.org/debian unstable/main amd64 python3 amd64 3.10.6-1 [38.2 kB]
Get:16 http://cdn-aws.deb.debian.org/debian unstable/main amd64 netbase all 6.3 [19.9 kB]
Get:17 http://cdn-aws.deb.debian.org/debian unstable/main amd64 sensible-utils all 0.0.17 [21.5 kB]
Get:18 http://cdn-aws.deb.debian.org/debian unstable/main amd64 libmagic-mgc amd64 1:5.41-4 [295 kB]
Get:19 http://cdn-aws.deb.debian.org/debian unstable/main amd64 libmagic1 amd64 1:5.41-4 [129 kB]
Get:20 http://cdn-aws.deb.debian.org/debian unstable/main amd64 file amd64 1:5.41-4 [67.0 kB]
Get:21 http://cdn-aws.deb.debian.org/debian unstable/main amd64 gettext-base amd64 0.21-9 [175 kB]
Get:22 http://cdn-aws.deb.debian.org/debian unstable/main amd64 libuchardet0 amd64 0.0.7-1 [67.8 kB]
Get:23 http://cdn-aws.deb.debian.org/debian unstable/main amd64 groff-base amd64 1.22.4-8 [936 kB]
Get:24 http://cdn-aws.deb.debian.org/debian unstable/main amd64 bsdextrautils amd64 2.38.1-1 [145 kB]
Get:25 http://cdn-aws.deb.debian.org/debian unstable/main amd64 libpipeline1 amd64 1.5.6-2 [39.4 kB]
Get:26 http://cdn-aws.deb.debian.org/debian unstable/main amd64 man-db amd64 2.10.2-3 [1413 kB]
Get:27 http://cdn-aws.deb.debian.org/debian unstable/main amd64 ucf all 3.0043 [74.0 kB]
Get:28 http://cdn-aws.deb.debian.org/debian unstable/main amd64 m4 amd64 1.4.19-1 [291 kB]
Get:29 http://cdn-aws.deb.debian.org/debian unstable/main amd64 autoconf all 2.71-2 [343 kB]
Get:30 http://cdn-aws.deb.debian.org/debian unstable/main amd64 autotools-dev all 20220109.1 [51.6 kB]
Get:31 http://cdn-aws.deb.debian.org/debian unstable/main amd64 automake all 1:1.16.5-1.3 [823 kB]
Get:32 http://cdn-aws.deb.debian.org/debian unstable/main amd64 autopoint all 0.21-9 [510 kB]
Get:33 http://cdn-aws.deb.debian.org/debian unstable/main amd64 libdebhelper-perl all 13.9.1 [196 kB]
Get:34 http://cdn-aws.deb.debian.org/debian unstable/main amd64 libtool all 2.4.7-4 [526 kB]
Get:35 http://cdn-aws.deb.debian.org/debian unstable/main amd64 dh-autoreconf all 20 [17.1 kB]
Get:36 http://cdn-aws.deb.debian.org/debian unstable/main amd64 libarchive-zip-perl all 1.68-1 [104 kB]
Get:37 http://cdn-aws.deb.debian.org/debian unstable/main amd64 libsub-override-perl all 0.09-3 [10.4 kB]
Get:38 http://cdn-aws.deb.debian.org/debian unstable/main amd64 libfile-stripnondeterminism-perl all 1.13.0-1 [26.6 kB]
Get:39 http://cdn-aws.deb.debian.org/debian unstable/main amd64 dh-strip-nondeterminism all 1.13.0-1 [15.8 kB]
Get:40 http://cdn-aws.deb.debian.org/debian unstable/main amd64 libelf1 amd64 0.187-2 [179 kB]
Get:41 http://cdn-aws.deb.debian.org/debian unstable/main amd64 dwz amd64 0.14-1 [98.3 kB]
Get:42 http://cdn-aws.deb.debian.org/debian unstable/main amd64 libicu71 amd64 71.1-3 [9218 kB]
Get:43 http://cdn-aws.deb.debian.org/debian unstable/main amd64 libxml2 amd64 2.9.14+dfsg-1+b1 [708 kB]
Get:44 http://cdn-aws.deb.debian.org/debian unstable/main amd64 gettext amd64 0.21-9 [1315 kB]
Get:45 http://cdn-aws.deb.debian.org/debian unstable/main amd64 intltool-debian all 0.35.0+20060710.5 [26.8 kB]
Get:46 http://cdn-aws.deb.debian.org/debian unstable/main amd64 po-debconf all 1.0.21+nmu1 [248 kB]
Get:47 http://cdn-aws.deb.debian.org/debian unstable/main amd64 debhelper all 13.9.1 [1071 kB]
Get:48 http://cdn-aws.deb.debian.org/debian unstable/main amd64 libassuan0 amd64 2.5.5-4 [51.3 kB]
Get:49 http://cdn-aws.deb.debian.org/debian unstable/main amd64 gpgconf amd64 2.2.39-1 [585 kB]
Get:50 http://cdn-aws.deb.debian.org/debian unstable/main amd64 libksba8 amd64 1.6.0-3 [128 kB]
Get:51 http://cdn-aws.deb.debian.org/debian unstable/main amd64 libsasl2-modules-db amd64 2.1.28+dfsg-8 [38.7 kB]
Get:52 http://cdn-aws.deb.debian.org/debian unstable/main amd64 libsasl2-2 amd64 2.1.28+dfsg-8 [78.2 kB]
Get:53 http://cdn-aws.deb.debian.org/debian unstable/main amd64 libldap-2.5-0 amd64 2.5.12+dfsg-2+b1 [226 kB]
Get:54 http://cdn-aws.deb.debian.org/debian unstable/main amd64 libnpth0 amd64 1.6-3 [19.0 kB]
Get:55 http://cdn-aws.deb.debian.org/debian unstable/main amd64 dirmngr amd64 2.2.39-1 [811 kB]
Get:56 http://cdn-aws.deb.debian.org/debian unstable/main amd64 gnupg-l10n all 2.2.39-1 [1113 kB]
Get:57 http://cdn-aws.deb.debian.org/debian unstable/main amd64 gnupg-utils amd64 2.2.39-1 [948 kB]
Get:58 http://cdn-aws.deb.debian.org/debian unstable/main amd64 gpg amd64 2.2.39-1 [969 kB]
Get:59 http://cdn-aws.deb.debian.org/debian unstable/main amd64 pinentry-curses amd64 1.2.0-2 [76.7 kB]
Get:60 http://cdn-aws.deb.debian.org/debian unstable/main amd64 gpg-agent amd64 2.2.39-1 [715 kB]
Get:61 http://cdn-aws.deb.debian.org/debian unstable/main amd64 gpg-wks-client amd64 2.2.39-1 [558 kB]
Get:62 http://cdn-aws.deb.debian.org/debian unstable/main amd64 gpg-wks-server amd64 2.2.39-1 [552 kB]
Get:63 http://cdn-aws.deb.debian.org/debian unstable/main amd64 gpgsm amd64 2.2.39-1 [691 kB]
Get:64 http://cdn-aws.deb.debian.org/debian unstable/main amd64 gnupg all 2.2.39-1 [865 kB]
Get:65 http://cdn-aws.deb.debian.org/debian unstable/main amd64 libfile-dirlist-perl all 0.05-2 [7444 B]
Get:66 http://cdn-aws.deb.debian.org/debian unstable/main amd64 libfile-which-perl all 1.27-1 [17.3 kB]
Get:67 http://cdn-aws.deb.debian.org/debian unstable/main amd64 libfile-homedir-perl all 1.006-1 [43.8 kB]
Get:68 http://cdn-aws.deb.debian.org/debian unstable/main amd64 libfile-touch-perl all 0.12-1 [10.5 kB]
Get:69 http://cdn-aws.deb.debian.org/debian unstable/main amd64 libio-pty-perl amd64 1:1.15-2+b1 [37.2 kB]
Get:70 http://cdn-aws.deb.debian.org/debian unstable/main amd64 libipc-run-perl all 20220807.0-1 [104 kB]
Get:71 http://cdn-aws.deb.debian.org/debian unstable/main amd64 libclass-method-modifiers-perl all 2.13-2 [19.4 kB]
Get:72 http://cdn-aws.deb.debian.org/debian unstable/main amd64 libclass-xsaccessor-perl amd64 1.19-4 [37.5 kB]
Get:73 http://cdn-aws.deb.debian.org/debian unstable/main amd64 libb-hooks-op-check-perl amd64 0.22-2 [11.2 kB]
Get:74 http://cdn-aws.deb.debian.org/debian unstable/main amd64 libdynaloader-functions-perl all 0.003-2 [13.1 kB]
Get:75 http://cdn-aws.deb.debian.org/debian unstable/main amd64 libdevel-callchecker-perl amd64 0.008-1+b3 [16.0 kB]
Get:76 http://cdn-aws.deb.debian.org/debian unstable/main amd64 libparams-classify-perl amd64 0.015-2 [25.6 kB]
Get:77 http://cdn-aws.deb.debian.org/debian unstable/main amd64 libmodule-runtime-perl all 0.016-2 [19.6 kB]
Get:78 http://cdn-aws.deb.debian.org/debian unstable/main amd64 libimport-into-perl all 1.002005-2 [11.3 kB]
Get:79 http://cdn-aws.deb.debian.org/debian unstable/main amd64 librole-tiny-perl all 2.002004-1 [21.4 kB]
Get:80 http://cdn-aws.deb.debian.org/debian unstable/main amd64 libsub-quote-perl all 2.006006-1 [21.0 kB]
Get:81 http://cdn-aws.deb.debian.org/debian unstable/main amd64 libmoo-perl all 2.005004-3 [60.5 kB]
Get:82 http://cdn-aws.deb.debian.org/debian unstable/main amd64 libencode-locale-perl all 1.05-2 [13.5 kB]
Get:83 http://cdn-aws.deb.debian.org/debian unstable/main amd64 libtimedate-perl all 2.3300-2 [39.3 kB]
Get:84 http://cdn-aws.deb.debian.org/debian unstable/main amd64 libhttp-date-perl all 6.05-2 [10.5 kB]
Get:85 http://cdn-aws.deb.debian.org/debian unstable/main amd64 libfile-listing-perl all 6.15-1 [12.6 kB]
Get:86 http://cdn-aws.deb.debian.org/debian unstable/main amd64 libhtml-tagset-perl all 3.20-5 [13.1 kB]
Get:87 http://cdn-aws.deb.debian.org/debian unstable/main amd64 libregexp-ipv6-perl all 0.03-3 [5212 B]
Get:88 http://cdn-aws.deb.debian.org/debian unstable/main amd64 liburi-perl all 5.12-1 [93.7 kB]
Get:89 http://cdn-aws.deb.debian.org/debian unstable/main amd64 libhtml-parser-perl amd64 3.78-1 [105 kB]
Get:90 http://cdn-aws.deb.debian.org/debian unstable/main amd64 libhtml-tree-perl all 5.07-2 [213 kB]
Get:91 http://cdn-aws.deb.debian.org/debian unstable/main amd64 libio-html-perl all 1.004-3 [16.2 kB]
Get:92 http://cdn-aws.deb.debian.org/debian unstable/main amd64 liblwp-mediatypes-perl all 6.04-1 [19.9 kB]
Get:93 http://cdn-aws.deb.debian.org/debian unstable/main amd64 libhttp-message-perl all 6.37-1 [80.9 kB]
Get:94 http://cdn-aws.deb.debian.org/debian unstable/main amd64 libhttp-cookies-perl all 6.10-1 [19.6 kB]
Get:95 http://cdn-aws.deb.debian.org/debian unstable/main amd64 libhttp-negotiate-perl all 6.01-1 [12.8 kB]
Get:96 http://cdn-aws.deb.debian.org/debian unstable/main amd64 perl-openssl-defaults amd64 7+b1 [7924 B]
Get:97 http://cdn-aws.deb.debian.org/debian unstable/main amd64 libnet-ssleay-perl amd64 1.92-2 [343 kB]
Get:98 http://cdn-aws.deb.debian.org/debian unstable/main amd64 libio-socket-ssl-perl all 2.075-1 [220 kB]
Get:99 http://cdn-aws.deb.debian.org/debian unstable/main amd64 libnet-http-perl all 6.22-1 [25.3 kB]
Get:100 http://cdn-aws.deb.debian.org/debian unstable/main amd64 liblwp-protocol-https-perl all 6.10-1 [12.2 kB]
Get:101 http://cdn-aws.deb.debian.org/debian unstable/main amd64 libtry-tiny-perl all 0.31-1 [24.2 kB]
Get:102 http://cdn-aws.deb.debian.org/debian unstable/main amd64 libwww-robotrules-perl all 6.02-1 [12.9 kB]
Get:103 http://cdn-aws.deb.debian.org/debian unstable/main amd64 libwww-perl all 6.67-1 [194 kB]
Get:104 http://cdn-aws.deb.debian.org/debian unstable/main amd64 patchutils amd64 0.4.2-1 [77.5 kB]
Get:105 http://cdn-aws.deb.debian.org/debian unstable/main amd64 wdiff amd64 1.2.2-2+b1 [122 kB]
Get:106 http://cdn-aws.deb.debian.org/debian unstable/main amd64 devscripts amd64 2.22.2 [1182 kB]
Get:107 http://cdn-aws.deb.debian.org/debian unstable/main amd64 libbrotli1 amd64 1.0.9-2+b4 [275 kB]
Get:108 http://cdn-aws.deb.debian.org/debian unstable/main amd64 libpng16-16 amd64 1.6.37-5 [290 kB]
Get:109 http://cdn-aws.deb.debian.org/debian unstable/main amd64 libfreetype6 amd64 2.12.1+dfsg-3 [420 kB]
Get:110 http://cdn-aws.deb.debian.org/debian unstable/main amd64 fonts-dejavu-core all 2.37-2 [1069 kB]
Get:111 http://cdn-aws.deb.debian.org/debian unstable/main amd64 fontconfig-config all 2.13.1-4.4 [281 kB]
Get:112 http://cdn-aws.deb.debian.org/debian unstable/main amd64 libfontconfig1 amd64 2.13.1-4.4 [350 kB]
Get:113 http://cdn-aws.deb.debian.org/debian unstable/main amd64 fontconfig amd64 2.13.1-4.4 [417 kB]
Get:114 http://cdn-aws.deb.debian.org/debian unstable/main amd64 gem2deb-test-runner amd64 2.0.3 [28.1 kB]
Get:115 http://cdn-aws.deb.debian.org/debian unstable/main amd64 gem2deb amd64 2.0.3 [65.0 kB]
Get:116 http://cdn-aws.deb.debian.org/debian unstable/main amd64 libann0 amd64 1.1.2+doc-8+b1 [26.0 kB]
Get:117 http://cdn-aws.deb.debian.org/debian unstable/main amd64 libcdt5 amd64 2.42.2-7 [62.2 kB]
Get:118 http://cdn-aws.deb.debian.org/debian unstable/main amd64 libcgraph6 amd64 2.42.2-7 [86.1 kB]
Get:119 http://cdn-aws.deb.debian.org/debian unstable/main amd64 libjpeg62-turbo amd64 1:2.1.2-1 [164 kB]
Get:120 http://cdn-aws.deb.debian.org/debian unstable/main amd64 libdeflate0 amd64 1.12-1 [71.6 kB]
Get:121 http://cdn-aws.deb.debian.org/debian unstable/main amd64 libjbig0 amd64 2.1-3.1+b2 [31.0 kB]
Get:122 http://cdn-aws.deb.debian.org/debian unstable/main amd64 liblerc4 amd64 4.0.0+ds-1 [170 kB]
Get:123 http://cdn-aws.deb.debian.org/debian unstable/main amd64 libwebp7 amd64 1.2.2-2+b1 [277 kB]
Get:124 http://cdn-aws.deb.debian.org/debian unstable/main amd64 libtiff5 amd64 4.4.0-4 [314 kB]
Get:125 http://cdn-aws.deb.debian.org/debian unstable/main amd64 libxau6 amd64 1:1.0.9-1 [19.7 kB]
Get:126 http://cdn-aws.deb.debian.org/debian unstable/main amd64 libxdmcp6 amd64 1:1.1.2-3 [26.3 kB]
Get:127 http://cdn-aws.deb.debian.org/debian unstable/main amd64 libxcb1 amd64 1.15-1 [144 kB]
Get:128 http://cdn-aws.deb.debian.org/debian unstable/main amd64 libx11-data all 2:1.8.1-2 [308 kB]
Get:129 http://cdn-aws.deb.debian.org/debian unstable/main amd64 libx11-6 amd64 2:1.8.1-2 [772 kB]
Get:130 http://cdn-aws.deb.debian.org/debian unstable/main amd64 libxpm4 amd64 1:3.5.12-1 [49.1 kB]
Get:131 http://cdn-aws.deb.debian.org/debian unstable/main amd64 libgd3 amd64 2.3.3-6 [135 kB]
Get:132 http://cdn-aws.deb.debian.org/debian unstable/main amd64 libglib2.0-0 amd64 2.73.3-3 [1461 kB]
Get:133 http://cdn-aws.deb.debian.org/debian unstable/main amd64 libgts-0.7-5 amd64 0.7.6+darcs121130-5 [159 kB]
Get:134 http://cdn-aws.deb.debian.org/debian unstable/main amd64 libpixman-1-0 amd64 0.40.0-1 [543 kB]
Get:135 http://cdn-aws.deb.debian.org/debian unstable/main amd64 libxcb-render0 amd64 1.15-1 [115 kB]
Get:136 http://cdn-aws.deb.debian.org/debian unstable/main amd64 libxcb-shm0 amd64 1.15-1 [105 kB]
Get:137 http://cdn-aws.deb.debian.org/debian unstable/main amd64 libxext6 amd64 2:1.3.4-1 [53.1 kB]
Get:138 http://cdn-aws.deb.debian.org/debian unstable/main amd64 libxrender1 amd64 1:0.9.10-1.1 [33.2 kB]
Get:139 http://cdn-aws.deb.debian.org/debian unstable/main amd64 libcairo2 amd64 1.16.0-6 [587 kB]
Get:140 http://cdn-aws.deb.debian.org/debian unstable/main amd64 libltdl7 amd64 2.4.7-4 [402 kB]
Get:141 http://cdn-aws.deb.debian.org/debian unstable/main amd64 libfribidi0 amd64 1.0.8-2.1 [65.0 kB]
Get:142 http://cdn-aws.deb.debian.org/debian unstable/main amd64 libgraphite2-3 amd64 1.3.14-1 [81.2 kB]
Get:143 http://cdn-aws.deb.debian.org/debian unstable/main amd64 libharfbuzz0b amd64 2.7.4-1+b1 [1469 kB]
Get:144 http://cdn-aws.deb.debian.org/debian unstable/main amd64 libthai-data all 0.1.29-1 [176 kB]
Get:145 http://cdn-aws.deb.debian.org/debian unstable/main amd64 libdatrie1 amd64 0.2.13-2 [43.0 kB]
Get:146 http://cdn-aws.deb.debian.org/debian unstable/main amd64 libthai0 amd64 0.1.29-1 [57.5 kB]
Get:147 http://cdn-aws.deb.debian.org/debian unstable/main amd64 libpango-1.0-0 amd64 1.50.9+ds-1 [239 kB]
Get:148 http://cdn-aws.deb.debian.org/debian unstable/main amd64 libpangoft2-1.0-0 amd64 1.50.9+ds-1 [75.3 kB]
Get:149 http://cdn-aws.deb.debian.org/debian unstable/main amd64 libpangocairo-1.0-0 amd64 1.50.9+ds-1 [62.5 kB]
Get:150 http://cdn-aws.deb.debian.org/debian unstable/main amd64 libpathplan4 amd64 2.42.2-7 [64.3 kB]
Get:151 http://cdn-aws.deb.debian.org/debian unstable/main amd64 libgvc6 amd64 2.42.2-7 [696 kB]
Get:152 http://cdn-aws.deb.debian.org/debian unstable/main amd64 libgvpr2 amd64 2.42.2-7 [212 kB]
Get:153 http://cdn-aws.deb.debian.org/debian unstable/main amd64 liblab-gamut1 amd64 2.42.2-7 [221 kB]
Get:154 http://cdn-aws.deb.debian.org/debian unstable/main amd64 x11-common all 1:7.7+23 [252 kB]
Get:155 http://cdn-aws.deb.debian.org/debian unstable/main amd64 libice6 amd64 2:1.0.10-1 [58.5 kB]
Get:156 http://cdn-aws.deb.debian.org/debian unstable/main amd64 libsm6 amd64 2:1.2.3-1 [35.1 kB]
Get:157 http://cdn-aws.deb.debian.org/debian unstable/main amd64 libxt6 amd64 1:1.2.1-1 [189 kB]
Get:158 http://cdn-aws.deb.debian.org/debian unstable/main amd64 libxmu6 amd64 2:1.1.3-3 [60.1 kB]
Get:159 http://cdn-aws.deb.debian.org/debian unstable/main amd64 libxaw7 amd64 2:1.0.14-1 [201 kB]
Get:160 http://cdn-aws.deb.debian.org/debian unstable/main amd64 graphviz amd64 2.42.2-7 [636 kB]
debconf: delaying package configuration, since apt-utils is not installed
Fetched 51.8 MB in 2s (28.5 MB/s)
Selecting previously unselected package libpython3.10-minimal:amd64.
(Reading database ... 20115 files and directories currently installed.)
Preparing to unpack .../libpython3.10-minimal_3.10.7-1_amd64.deb ...
Unpacking libpython3.10-minimal:amd64 (3.10.7-1) ...
Selecting previously unselected package libexpat1:amd64.
Preparing to unpack .../libexpat1_2.4.8-1_amd64.deb ...
Unpacking libexpat1:amd64 (2.4.8-1) ...
Selecting previously unselected package python3.10-minimal.
Preparing to unpack .../python3.10-minimal_3.10.7-1_amd64.deb ...
Unpacking python3.10-minimal (3.10.7-1) ...
Setting up libpython3.10-minimal:amd64 (3.10.7-1) ...
Setting up libexpat1:amd64 (2.4.8-1) ...
Setting up python3.10-minimal (3.10.7-1) ...
Selecting previously unselected package python3-minimal.
(Reading database ... 20418 files and directories currently installed.)
Preparing to unpack .../0-python3-minimal_3.10.6-1_amd64.deb ...
Unpacking python3-minimal (3.10.6-1) ...
Selecting previously unselected package media-types.
Preparing to unpack .../1-media-types_8.0.0_all.deb ...
Unpacking media-types (8.0.0) ...
Selecting previously unselected package libmpdec3:amd64.
Preparing to unpack .../2-libmpdec3_2.5.1-2_amd64.deb ...
Unpacking libmpdec3:amd64 (2.5.1-2) ...
Selecting previously unselected package libncursesw6:amd64.
Preparing to unpack .../3-libncursesw6_6.3+20220423-2_amd64.deb ...
Unpacking libncursesw6:amd64 (6.3+20220423-2) ...
Selecting previously unselected package readline-common.
Preparing to unpack .../4-readline-common_8.2~rc2-2_all.deb ...
Unpacking readline-common (8.2~rc2-2) ...
Selecting previously unselected package libreadline8:amd64.
Preparing to unpack .../5-libreadline8_8.2~rc2-2_amd64.deb ...
Unpacking libreadline8:amd64 (8.2~rc2-2) ...
Selecting previously unselected package libsqlite3-0:amd64.
Preparing to unpack .../6-libsqlite3-0_3.39.3-1_amd64.deb ...
Unpacking libsqlite3-0:amd64 (3.39.3-1) ...
Selecting previously unselected package libpython3.10-stdlib:amd64.
Preparing to unpack .../7-libpython3.10-stdlib_3.10.7-1_amd64.deb ...
Unpacking libpython3.10-stdlib:amd64 (3.10.7-1) ...
Selecting previously unselected package python3.10.
Preparing to unpack .../8-python3.10_3.10.7-1_amd64.deb ...
Unpacking python3.10 (3.10.7-1) ...
Selecting previously unselected package libpython3-stdlib:amd64.
Preparing to unpack .../9-libpython3-stdlib_3.10.6-1_amd64.deb ...
Unpacking libpython3-stdlib:amd64 (3.10.6-1) ...
Setting up python3-minimal (3.10.6-1) ...
Selecting previously unselected package python3.
(Reading database ... 20861 files and directories currently installed.)
Preparing to unpack .../000-python3_3.10.6-1_amd64.deb ...
Unpacking python3 (3.10.6-1) ...
Selecting previously unselected package netbase.
Preparing to unpack .../001-netbase_6.3_all.deb ...
Unpacking netbase (6.3) ...
Selecting previously unselected package sensible-utils.
Preparing to unpack .../002-sensible-utils_0.0.17_all.deb ...
Unpacking sensible-utils (0.0.17) ...
Selecting previously unselected package libmagic-mgc.
Preparing to unpack .../003-libmagic-mgc_1%3a5.41-4_amd64.deb ...
Unpacking libmagic-mgc (1:5.41-4) ...
Selecting previously unselected package libmagic1:amd64.
Preparing to unpack .../004-libmagic1_1%3a5.41-4_amd64.deb ...
Unpacking libmagic1:amd64 (1:5.41-4) ...
Selecting previously unselected package file.
Preparing to unpack .../005-file_1%3a5.41-4_amd64.deb ...
Unpacking file (1:5.41-4) ...
Selecting previously unselected package gettext-base.
Preparing to unpack .../006-gettext-base_0.21-9_amd64.deb ...
Unpacking gettext-base (0.21-9) ...
Selecting previously unselected package libuchardet0:amd64.
Preparing to unpack .../007-libuchardet0_0.0.7-1_amd64.deb ...
Unpacking libuchardet0:amd64 (0.0.7-1) ...
Selecting previously unselected package groff-base.
Preparing to unpack .../008-groff-base_1.22.4-8_amd64.deb ...
Unpacking groff-base (1.22.4-8) ...
Selecting previously unselected package bsdextrautils.
Preparing to unpack .../009-bsdextrautils_2.38.1-1_amd64.deb ...
Unpacking bsdextrautils (2.38.1-1) ...
Selecting previously unselected package libpipeline1:amd64.
Preparing to unpack .../010-libpipeline1_1.5.6-2_amd64.deb ...
Unpacking libpipeline1:amd64 (1.5.6-2) ...
Selecting previously unselected package man-db.
Preparing to unpack .../011-man-db_2.10.2-3_amd64.deb ...
Unpacking man-db (2.10.2-3) ...
Selecting previously unselected package ucf.
Preparing to unpack .../012-ucf_3.0043_all.deb ...
Moving old data out of the way
Unpacking ucf (3.0043) ...
Selecting previously unselected package m4.
Preparing to unpack .../013-m4_1.4.19-1_amd64.deb ...
Unpacking m4 (1.4.19-1) ...
Selecting previously unselected package autoconf.
Preparing to unpack .../014-autoconf_2.71-2_all.deb ...
Unpacking autoconf (2.71-2) ...
Selecting previously unselected package autotools-dev.
Preparing to unpack .../015-autotools-dev_20220109.1_all.deb ...
Unpacking autotools-dev (20220109.1) ...
Selecting previously unselected package automake.
Preparing to unpack .../016-automake_1%3a1.16.5-1.3_all.deb ...
Unpacking automake (1:1.16.5-1.3) ...
Selecting previously unselected package autopoint.
Preparing to unpack .../017-autopoint_0.21-9_all.deb ...
Unpacking autopoint (0.21-9) ...
Selecting previously unselected package libdebhelper-perl.
Preparing to unpack .../018-libdebhelper-perl_13.9.1_all.deb ...
Unpacking libdebhelper-perl (13.9.1) ...
Selecting previously unselected package libtool.
Preparing to unpack .../019-libtool_2.4.7-4_all.deb ...
Unpacking libtool (2.4.7-4) ...
Selecting previously unselected package dh-autoreconf.
Preparing to unpack .../020-dh-autoreconf_20_all.deb ...
Unpacking dh-autoreconf (20) ...
Selecting previously unselected package libarchive-zip-perl.
Preparing to unpack .../021-libarchive-zip-perl_1.68-1_all.deb ...
Unpacking libarchive-zip-perl (1.68-1) ...
Selecting previously unselected package libsub-override-perl.
Preparing to unpack .../022-libsub-override-perl_0.09-3_all.deb ...
Unpacking libsub-override-perl (0.09-3) ...
Selecting previously unselected package libfile-stripnondeterminism-perl.
Preparing to unpack .../023-libfile-stripnondeterminism-perl_1.13.0-1_all.deb ...
Unpacking libfile-stripnondeterminism-perl (1.13.0-1) ...
Selecting previously unselected package dh-strip-nondeterminism.
Preparing to unpack .../024-dh-strip-nondeterminism_1.13.0-1_all.deb ...
Unpacking dh-strip-nondeterminism (1.13.0-1) ...
Selecting previously unselected package libelf1:amd64.
Preparing to unpack .../025-libelf1_0.187-2_amd64.deb ...
Unpacking libelf1:amd64 (0.187-2) ...
Selecting previously unselected package dwz.
Preparing to unpack .../026-dwz_0.14-1_amd64.deb ...
Unpacking dwz (0.14-1) ...
Selecting previously unselected package libicu71:amd64.
Preparing to unpack .../027-libicu71_71.1-3_amd64.deb ...
Unpacking libicu71:amd64 (71.1-3) ...
Selecting previously unselected package libxml2:amd64.
Preparing to unpack .../028-libxml2_2.9.14+dfsg-1+b1_amd64.deb ...
Unpacking libxml2:amd64 (2.9.14+dfsg-1+b1) ...
Selecting previously unselected package gettext.
Preparing to unpack .../029-gettext_0.21-9_amd64.deb ...
Unpacking gettext (0.21-9) ...
Selecting previously unselected package intltool-debian.
Preparing to unpack .../030-intltool-debian_0.35.0+20060710.5_all.deb ...
Unpacking intltool-debian (0.35.0+20060710.5) ...
Selecting previously unselected package po-debconf.
Preparing to unpack .../031-po-debconf_1.0.21+nmu1_all.deb ...
Unpacking po-debconf (1.0.21+nmu1) ...
Selecting previously unselected package debhelper.
Preparing to unpack .../032-debhelper_13.9.1_all.deb ...
Unpacking debhelper (13.9.1) ...
Selecting previously unselected package libassuan0:amd64.
Preparing to unpack .../033-libassuan0_2.5.5-4_amd64.deb ...
Unpacking libassuan0:amd64 (2.5.5-4) ...
Selecting previously unselected package gpgconf.
Preparing to unpack .../034-gpgconf_2.2.39-1_amd64.deb ...
Unpacking gpgconf (2.2.39-1) ...
Selecting previously unselected package libksba8:amd64.
Preparing to unpack .../035-libksba8_1.6.0-3_amd64.deb ...
Unpacking libksba8:amd64 (1.6.0-3) ...
Selecting previously unselected package libsasl2-modules-db:amd64.
Preparing to unpack .../036-libsasl2-modules-db_2.1.28+dfsg-8_amd64.deb ...
Unpacking libsasl2-modules-db:amd64 (2.1.28+dfsg-8) ...
Selecting previously unselected package libsasl2-2:amd64.
Preparing to unpack .../037-libsasl2-2_2.1.28+dfsg-8_amd64.deb ...
Unpacking libsasl2-2:amd64 (2.1.28+dfsg-8) ...
Selecting previously unselected package libldap-2.5-0:amd64.
Preparing to unpack .../038-libldap-2.5-0_2.5.12+dfsg-2+b1_amd64.deb ...
Unpacking libldap-2.5-0:amd64 (2.5.12+dfsg-2+b1) ...
Selecting previously unselected package libnpth0:amd64.
Preparing to unpack .../039-libnpth0_1.6-3_amd64.deb ...
Unpacking libnpth0:amd64 (1.6-3) ...
Selecting previously unselected package dirmngr.
Preparing to unpack .../040-dirmngr_2.2.39-1_amd64.deb ...
Unpacking dirmngr (2.2.39-1) ...
Selecting previously unselected package gnupg-l10n.
Preparing to unpack .../041-gnupg-l10n_2.2.39-1_all.deb ...
Unpacking gnupg-l10n (2.2.39-1) ...
Selecting previously unselected package gnupg-utils.
Preparing to unpack .../042-gnupg-utils_2.2.39-1_amd64.deb ...
Unpacking gnupg-utils (2.2.39-1) ...
Selecting previously unselected package gpg.
Preparing to unpack .../043-gpg_2.2.39-1_amd64.deb ...
Unpacking gpg (2.2.39-1) ...
Selecting previously unselected package pinentry-curses.
Preparing to unpack .../044-pinentry-curses_1.2.0-2_amd64.deb ...
Unpacking pinentry-curses (1.2.0-2) ...
Selecting previously unselected package gpg-agent.
Preparing to unpack .../045-gpg-agent_2.2.39-1_amd64.deb ...
Unpacking gpg-agent (2.2.39-1) ...
Selecting previously unselected package gpg-wks-client.
Preparing to unpack .../046-gpg-wks-client_2.2.39-1_amd64.deb ...
Unpacking gpg-wks-client (2.2.39-1) ...
Selecting previously unselected package gpg-wks-server.
Preparing to unpack .../047-gpg-wks-server_2.2.39-1_amd64.deb ...
Unpacking gpg-wks-server (2.2.39-1) ...
Selecting previously unselected package gpgsm.
Preparing to unpack .../048-gpgsm_2.2.39-1_amd64.deb ...
Unpacking gpgsm (2.2.39-1) ...
Selecting previously unselected package gnupg.
Preparing to unpack .../049-gnupg_2.2.39-1_all.deb ...
Unpacking gnupg (2.2.39-1) ...
Selecting previously unselected package libfile-dirlist-perl.
Preparing to unpack .../050-libfile-dirlist-perl_0.05-2_all.deb ...
Unpacking libfile-dirlist-perl (0.05-2) ...
Selecting previously unselected package libfile-which-perl.
Preparing to unpack .../051-libfile-which-perl_1.27-1_all.deb ...
Unpacking libfile-which-perl (1.27-1) ...
Selecting previously unselected package libfile-homedir-perl.
Preparing to unpack .../052-libfile-homedir-perl_1.006-1_all.deb ...
Unpacking libfile-homedir-perl (1.006-1) ...
Selecting previously unselected package libfile-touch-perl.
Preparing to unpack .../053-libfile-touch-perl_0.12-1_all.deb ...
Unpacking libfile-touch-perl (0.12-1) ...
Selecting previously unselected package libio-pty-perl.
Preparing to unpack .../054-libio-pty-perl_1%3a1.15-2+b1_amd64.deb ...
Unpacking libio-pty-perl (1:1.15-2+b1) ...
Selecting previously unselected package libipc-run-perl.
Preparing to unpack .../055-libipc-run-perl_20220807.0-1_all.deb ...
Unpacking libipc-run-perl (20220807.0-1) ...
Selecting previously unselected package libclass-method-modifiers-perl.
Preparing to unpack .../056-libclass-method-modifiers-perl_2.13-2_all.deb ...
Unpacking libclass-method-modifiers-perl (2.13-2) ...
Selecting previously unselected package libclass-xsaccessor-perl.
Preparing to unpack .../057-libclass-xsaccessor-perl_1.19-4_amd64.deb ...
Unpacking libclass-xsaccessor-perl (1.19-4) ...
Selecting previously unselected package libb-hooks-op-check-perl:amd64.
Preparing to unpack .../058-libb-hooks-op-check-perl_0.22-2_amd64.deb ...
Unpacking libb-hooks-op-check-perl:amd64 (0.22-2) ...
Selecting previously unselected package libdynaloader-functions-perl.
Preparing to unpack .../059-libdynaloader-functions-perl_0.003-2_all.deb ...
Unpacking libdynaloader-functions-perl (0.003-2) ...
Selecting previously unselected package libdevel-callchecker-perl.
Preparing to unpack .../060-libdevel-callchecker-perl_0.008-1+b3_amd64.deb ...
Unpacking libdevel-callchecker-perl (0.008-1+b3) ...
Selecting previously unselected package libparams-classify-perl:amd64.
Preparing to unpack .../061-libparams-classify-perl_0.015-2_amd64.deb ...
Unpacking libparams-classify-perl:amd64 (0.015-2) ...
Selecting previously unselected package libmodule-runtime-perl.
Preparing to unpack .../062-libmodule-runtime-perl_0.016-2_all.deb ...
Unpacking libmodule-runtime-perl (0.016-2) ...
Selecting previously unselected package libimport-into-perl.
Preparing to unpack .../063-libimport-into-perl_1.002005-2_all.deb ...
Unpacking libimport-into-perl (1.002005-2) ...
Selecting previously unselected package librole-tiny-perl.
Preparing to unpack .../064-librole-tiny-perl_2.002004-1_all.deb ...
Unpacking librole-tiny-perl (2.002004-1) ...
Selecting previously unselected package libsub-quote-perl.
Preparing to unpack .../065-libsub-quote-perl_2.006006-1_all.deb ...
Unpacking libsub-quote-perl (2.006006-1) ...
Selecting previously unselected package libmoo-perl.
Preparing to unpack .../066-libmoo-perl_2.005004-3_all.deb ...
Unpacking libmoo-perl (2.005004-3) ...
Selecting previously unselected package libencode-locale-perl.
Preparing to unpack .../067-libencode-locale-perl_1.05-2_all.deb ...
Unpacking libencode-locale-perl (1.05-2) ...
Selecting previously unselected package libtimedate-perl.
Preparing to unpack .../068-libtimedate-perl_2.3300-2_all.deb ...
Unpacking libtimedate-perl (2.3300-2) ...
Selecting previously unselected package libhttp-date-perl.
Preparing to unpack .../069-libhttp-date-perl_6.05-2_all.deb ...
Unpacking libhttp-date-perl (6.05-2) ...
Selecting previously unselected package libfile-listing-perl.
Preparing to unpack .../070-libfile-listing-perl_6.15-1_all.deb ...
Unpacking libfile-listing-perl (6.15-1) ...
Selecting previously unselected package libhtml-tagset-perl.
Preparing to unpack .../071-libhtml-tagset-perl_3.20-5_all.deb ...
Unpacking libhtml-tagset-perl (3.20-5) ...
Selecting previously unselected package libregexp-ipv6-perl.
Preparing to unpack .../072-libregexp-ipv6-perl_0.03-3_all.deb ...
Unpacking libregexp-ipv6-perl (0.03-3) ...
Selecting previously unselected package liburi-perl.
Preparing to unpack .../073-liburi-perl_5.12-1_all.deb ...
Unpacking liburi-perl (5.12-1) ...
Selecting previously unselected package libhtml-parser-perl:amd64.
Preparing to unpack .../074-libhtml-parser-perl_3.78-1_amd64.deb ...
Unpacking libhtml-parser-perl:amd64 (3.78-1) ...
Selecting previously unselected package libhtml-tree-perl.
Preparing to unpack .../075-libhtml-tree-perl_5.07-2_all.deb ...
Unpacking libhtml-tree-perl (5.07-2) ...
Selecting previously unselected package libio-html-perl.
Preparing to unpack .../076-libio-html-perl_1.004-3_all.deb ...
Unpacking libio-html-perl (1.004-3) ...
Selecting previously unselected package liblwp-mediatypes-perl.
Preparing to unpack .../077-liblwp-mediatypes-perl_6.04-1_all.deb ...
Unpacking liblwp-mediatypes-perl (6.04-1) ...
Selecting previously unselected package libhttp-message-perl.
Preparing to unpack .../078-libhttp-message-perl_6.37-1_all.deb ...
Unpacking libhttp-message-perl (6.37-1) ...
Selecting previously unselected package libhttp-cookies-perl.
Preparing to unpack .../079-libhttp-cookies-perl_6.10-1_all.deb ...
Unpacking libhttp-cookies-perl (6.10-1) ...
Selecting previously unselected package libhttp-negotiate-perl.
Preparing to unpack .../080-libhttp-negotiate-perl_6.01-1_all.deb ...
Unpacking libhttp-negotiate-perl (6.01-1) ...
Selecting previously unselected package perl-openssl-defaults:amd64.
Preparing to unpack .../081-perl-openssl-defaults_7+b1_amd64.deb ...
Unpacking perl-openssl-defaults:amd64 (7+b1) ...
Selecting previously unselected package libnet-ssleay-perl:amd64.
Preparing to unpack .../082-libnet-ssleay-perl_1.92-2_amd64.deb ...
Unpacking libnet-ssleay-perl:amd64 (1.92-2) ...
Selecting previously unselected package libio-socket-ssl-perl.
Preparing to unpack .../083-libio-socket-ssl-perl_2.075-1_all.deb ...
Unpacking libio-socket-ssl-perl (2.075-1) ...
Selecting previously unselected package libnet-http-perl.
Preparing to unpack .../084-libnet-http-perl_6.22-1_all.deb ...
Unpacking libnet-http-perl (6.22-1) ...
Selecting previously unselected package liblwp-protocol-https-perl.
Preparing to unpack .../085-liblwp-protocol-https-perl_6.10-1_all.deb ...
Unpacking liblwp-protocol-https-perl (6.10-1) ...
Selecting previously unselected package libtry-tiny-perl.
Preparing to unpack .../086-libtry-tiny-perl_0.31-1_all.deb ...
Unpacking libtry-tiny-perl (0.31-1) ...
Selecting previously unselected package libwww-robotrules-perl.
Preparing to unpack .../087-libwww-robotrules-perl_6.02-1_all.deb ...
Unpacking libwww-robotrules-perl (6.02-1) ...
Selecting previously unselected package libwww-perl.
Preparing to unpack .../088-libwww-perl_6.67-1_all.deb ...
Unpacking libwww-perl (6.67-1) ...
Selecting previously unselected package patchutils.
Preparing to unpack .../089-patchutils_0.4.2-1_amd64.deb ...
Unpacking patchutils (0.4.2-1) ...
Selecting previously unselected package wdiff.
Preparing to unpack .../090-wdiff_1.2.2-2+b1_amd64.deb ...
Unpacking wdiff (1.2.2-2+b1) ...
Selecting previously unselected package devscripts.
Preparing to unpack .../091-devscripts_2.22.2_amd64.deb ...
Unpacking devscripts (2.22.2) ...
Selecting previously unselected package libbrotli1:amd64.
Preparing to unpack .../092-libbrotli1_1.0.9-2+b4_amd64.deb ...
Unpacking libbrotli1:amd64 (1.0.9-2+b4) ...
Selecting previously unselected package libpng16-16:amd64.
Preparing to unpack .../093-libpng16-16_1.6.37-5_amd64.deb ...
Unpacking libpng16-16:amd64 (1.6.37-5) ...
Selecting previously unselected package libfreetype6:amd64.
Preparing to unpack .../094-libfreetype6_2.12.1+dfsg-3_amd64.deb ...
Unpacking libfreetype6:amd64 (2.12.1+dfsg-3) ...
Selecting previously unselected package fonts-dejavu-core.
Preparing to unpack .../095-fonts-dejavu-core_2.37-2_all.deb ...
Unpacking fonts-dejavu-core (2.37-2) ...
Selecting previously unselected package fontconfig-config.
Preparing to unpack .../096-fontconfig-config_2.13.1-4.4_all.deb ...
Unpacking fontconfig-config (2.13.1-4.4) ...
Selecting previously unselected package libfontconfig1:amd64.
Preparing to unpack .../097-libfontconfig1_2.13.1-4.4_amd64.deb ...
Unpacking libfontconfig1:amd64 (2.13.1-4.4) ...
Selecting previously unselected package fontconfig.
Preparing to unpack .../098-fontconfig_2.13.1-4.4_amd64.deb ...
Unpacking fontconfig (2.13.1-4.4) ...
Selecting previously unselected package gem2deb-test-runner.
Preparing to unpack .../099-gem2deb-test-runner_2.0.3_amd64.deb ...
Unpacking gem2deb-test-runner (2.0.3) ...
Selecting previously unselected package gem2deb.
Preparing to unpack .../100-gem2deb_2.0.3_amd64.deb ...
Unpacking gem2deb (2.0.3) ...
Selecting previously unselected package libann0.
Preparing to unpack .../101-libann0_1.1.2+doc-8+b1_amd64.deb ...
Unpacking libann0 (1.1.2+doc-8+b1) ...
Selecting previously unselected package libcdt5:amd64.
Preparing to unpack .../102-libcdt5_2.42.2-7_amd64.deb ...
Unpacking libcdt5:amd64 (2.42.2-7) ...
Selecting previously unselected package libcgraph6:amd64.
Preparing to unpack .../103-libcgraph6_2.42.2-7_amd64.deb ...
Unpacking libcgraph6:amd64 (2.42.2-7) ...
Selecting previously unselected package libjpeg62-turbo:amd64.
Preparing to unpack .../104-libjpeg62-turbo_1%3a2.1.2-1_amd64.deb ...
Unpacking libjpeg62-turbo:amd64 (1:2.1.2-1) ...
Selecting previously unselected package libdeflate0:amd64.
Preparing to unpack .../105-libdeflate0_1.12-1_amd64.deb ...
Unpacking libdeflate0:amd64 (1.12-1) ...
Selecting previously unselected package libjbig0:amd64.
Preparing to unpack .../106-libjbig0_2.1-3.1+b2_amd64.deb ...
Unpacking libjbig0:amd64 (2.1-3.1+b2) ...
Selecting previously unselected package liblerc4:amd64.
Preparing to unpack .../107-liblerc4_4.0.0+ds-1_amd64.deb ...
Unpacking liblerc4:amd64 (4.0.0+ds-1) ...
Selecting previously unselected package libwebp7:amd64.
Preparing to unpack .../108-libwebp7_1.2.2-2+b1_amd64.deb ...
Unpacking libwebp7:amd64 (1.2.2-2+b1) ...
Selecting previously unselected package libtiff5:amd64.
Preparing to unpack .../109-libtiff5_4.4.0-4_amd64.deb ...
Unpacking libtiff5:amd64 (4.4.0-4) ...
Selecting previously unselected package libxau6:amd64.
Preparing to unpack .../110-libxau6_1%3a1.0.9-1_amd64.deb ...
Unpacking libxau6:amd64 (1:1.0.9-1) ...
Selecting previously unselected package libxdmcp6:amd64.
Preparing to unpack .../111-libxdmcp6_1%3a1.1.2-3_amd64.deb ...
Unpacking libxdmcp6:amd64 (1:1.1.2-3) ...
Selecting previously unselected package libxcb1:amd64.
Preparing to unpack .../112-libxcb1_1.15-1_amd64.deb ...
Unpacking libxcb1:amd64 (1.15-1) ...
Selecting previously unselected package libx11-data.
Preparing to unpack .../113-libx11-data_2%3a1.8.1-2_all.deb ...
Unpacking libx11-data (2:1.8.1-2) ...
Selecting previously unselected package libx11-6:amd64.
Preparing to unpack .../114-libx11-6_2%3a1.8.1-2_amd64.deb ...
Unpacking libx11-6:amd64 (2:1.8.1-2) ...
Selecting previously unselected package libxpm4:amd64.
Preparing to unpack .../115-libxpm4_1%3a3.5.12-1_amd64.deb ...
Unpacking libxpm4:amd64 (1:3.5.12-1) ...
Selecting previously unselected package libgd3:amd64.
Preparing to unpack .../116-libgd3_2.3.3-6_amd64.deb ...
Unpacking libgd3:amd64 (2.3.3-6) ...
Selecting previously unselected package libglib2.0-0:amd64.
Preparing to unpack .../117-libglib2.0-0_2.73.3-3_amd64.deb ...
Unpacking libglib2.0-0:amd64 (2.73.3-3) ...
Selecting previously unselected package libgts-0.7-5:amd64.
Preparing to unpack .../118-libgts-0.7-5_0.7.6+darcs121130-5_amd64.deb ...
Unpacking libgts-0.7-5:amd64 (0.7.6+darcs121130-5) ...
Selecting previously unselected package libpixman-1-0:amd64.
Preparing to unpack .../119-libpixman-1-0_0.40.0-1_amd64.deb ...
Unpacking libpixman-1-0:amd64 (0.40.0-1) ...
Selecting previously unselected package libxcb-render0:amd64.
Preparing to unpack .../120-libxcb-render0_1.15-1_amd64.deb ...
Unpacking libxcb-render0:amd64 (1.15-1) ...
Selecting previously unselected package libxcb-shm0:amd64.
Preparing to unpack .../121-libxcb-shm0_1.15-1_amd64.deb ...
Unpacking libxcb-shm0:amd64 (1.15-1) ...
Selecting previously unselected package libxext6:amd64.
Preparing to unpack .../122-libxext6_2%3a1.3.4-1_amd64.deb ...
Unpacking libxext6:amd64 (2:1.3.4-1) ...
Selecting previously unselected package libxrender1:amd64.
Preparing to unpack .../123-libxrender1_1%3a0.9.10-1.1_amd64.deb ...
Unpacking libxrender1:amd64 (1:0.9.10-1.1) ...
Selecting previously unselected package libcairo2:amd64.
Preparing to unpack .../124-libcairo2_1.16.0-6_amd64.deb ...
Unpacking libcairo2:amd64 (1.16.0-6) ...
Selecting previously unselected package libltdl7:amd64.
Preparing to unpack .../125-libltdl7_2.4.7-4_amd64.deb ...
Unpacking libltdl7:amd64 (2.4.7-4) ...
Selecting previously unselected package libfribidi0:amd64.
Preparing to unpack .../126-libfribidi0_1.0.8-2.1_amd64.deb ...
Unpacking libfribidi0:amd64 (1.0.8-2.1) ...
Selecting previously unselected package libgraphite2-3:amd64.
Preparing to unpack .../127-libgraphite2-3_1.3.14-1_amd64.deb ...
Unpacking libgraphite2-3:amd64 (1.3.14-1) ...
Selecting previously unselected package libharfbuzz0b:amd64.
Preparing to unpack .../128-libharfbuzz0b_2.7.4-1+b1_amd64.deb ...
Unpacking libharfbuzz0b:amd64 (2.7.4-1+b1) ...
Selecting previously unselected package libthai-data.
Preparing to unpack .../129-libthai-data_0.1.29-1_all.deb ...
Unpacking libthai-data (0.1.29-1) ...
Selecting previously unselected package libdatrie1:amd64.
Preparing to unpack .../130-libdatrie1_0.2.13-2_amd64.deb ...
Unpacking libdatrie1:amd64 (0.2.13-2) ...
Selecting previously unselected package libthai0:amd64.
Preparing to unpack .../131-libthai0_0.1.29-1_amd64.deb ...
Unpacking libthai0:amd64 (0.1.29-1) ...
Selecting previously unselected package libpango-1.0-0:amd64.
Preparing to unpack .../132-libpango-1.0-0_1.50.9+ds-1_amd64.deb ...
Unpacking libpango-1.0-0:amd64 (1.50.9+ds-1) ...
Selecting previously unselected package libpangoft2-1.0-0:amd64.
Preparing to unpack .../133-libpangoft2-1.0-0_1.50.9+ds-1_amd64.deb ...
Unpacking libpangoft2-1.0-0:amd64 (1.50.9+ds-1) ...
Selecting previously unselected package libpangocairo-1.0-0:amd64.
Preparing to unpack .../134-libpangocairo-1.0-0_1.50.9+ds-1_amd64.deb ...
Unpacking libpangocairo-1.0-0:amd64 (1.50.9+ds-1) ...
Selecting previously unselected package libpathplan4:amd64.
Preparing to unpack .../135-libpathplan4_2.42.2-7_amd64.deb ...
Unpacking libpathplan4:amd64 (2.42.2-7) ...
Selecting previously unselected package libgvc6.
Preparing to unpack .../136-libgvc6_2.42.2-7_amd64.deb ...
Unpacking libgvc6 (2.42.2-7) ...
Selecting previously unselected package libgvpr2:amd64.
Preparing to unpack .../137-libgvpr2_2.42.2-7_amd64.deb ...
Unpacking libgvpr2:amd64 (2.42.2-7) ...
Selecting previously unselected package liblab-gamut1:amd64.
Preparing to unpack .../138-liblab-gamut1_2.42.2-7_amd64.deb ...
Unpacking liblab-gamut1:amd64 (2.42.2-7) ...
Selecting previously unselected package x11-common.
Preparing to unpack .../139-x11-common_1%3a7.7+23_all.deb ...
Unpacking x11-common (1:7.7+23) ...
Selecting previously unselected package libice6:amd64.
Preparing to unpack .../140-libice6_2%3a1.0.10-1_amd64.deb ...
Unpacking libice6:amd64 (2:1.0.10-1) ...
Selecting previously unselected package libsm6:amd64.
Preparing to unpack .../141-libsm6_2%3a1.2.3-1_amd64.deb ...
Unpacking libsm6:amd64 (2:1.2.3-1) ...
Selecting previously unselected package libxt6:amd64.
Preparing to unpack .../142-libxt6_1%3a1.2.1-1_amd64.deb ...
Unpacking libxt6:amd64 (1:1.2.1-1) ...
Selecting previously unselected package libxmu6:amd64.
Preparing to unpack .../143-libxmu6_2%3a1.1.3-3_amd64.deb ...
Unpacking libxmu6:amd64 (2:1.1.3-3) ...
Selecting previously unselected package libxaw7:amd64.
Preparing to unpack .../144-libxaw7_2%3a1.0.14-1_amd64.deb ...
Unpacking libxaw7:amd64 (2:1.0.14-1) ...
Selecting previously unselected package graphviz.
Preparing to unpack .../145-graphviz_2.42.2-7_amd64.deb ...
Unpacking graphviz (2.42.2-7) ...
Selecting previously unselected package sbuild-build-depends-main-dummy.
Preparing to unpack .../146-sbuild-build-depends-main-dummy_0.invalid.0_amd64.deb ...
Unpacking sbuild-build-depends-main-dummy (0.invalid.0) ...
Setting up libksba8:amd64 (1.6.0-3) ...
Setting up media-types (8.0.0) ...
Setting up libpipeline1:amd64 (1.5.6-2) ...
Setting up libgraphite2-3:amd64 (1.3.14-1) ...
Setting up libpixman-1-0:amd64 (0.40.0-1) ...
Setting up libicu71:amd64 (71.1-3) ...
Setting up wdiff (1.2.2-2+b1) ...
Setting up libfile-which-perl (1.27-1) ...
Setting up libxau6:amd64 (1:1.0.9-1) ...
Setting up libxdmcp6:amd64 (1:1.1.2-3) ...
Setting up libxcb1:amd64 (1.15-1) ...
Setting up liblerc4:amd64 (4.0.0+ds-1) ...
Setting up bsdextrautils (2.38.1-1) ...
Setting up libdynaloader-functions-perl (0.003-2) ...
Setting up libdatrie1:amd64 (0.2.13-2) ...
Setting up libclass-method-modifiers-perl (2.13-2) ...
Setting up libio-pty-perl (1:1.15-2+b1) ...
Setting up libmagic-mgc (1:5.41-4) ...
Setting up libxcb-render0:amd64 (1.15-1) ...
Setting up libarchive-zip-perl (1.68-1) ...
Setting up libglib2.0-0:amd64 (2.73.3-3) ...
No schema files found: doing nothing.
Setting up libhtml-tagset-perl (3.20-5) ...
Setting up libdebhelper-perl (13.9.1) ...
Setting up libbrotli1:amd64 (1.0.9-2+b4) ...
Setting up libsqlite3-0:amd64 (3.39.3-1) ...
Setting up liblwp-mediatypes-perl (6.04-1) ...
Setting up liblab-gamut1:amd64 (2.42.2-7) ...
Setting up x11-common (1:7.7+23) ...
invoke-rc.d: could not determine current runlevel
All runlevel operations denied by policy
invoke-rc.d: policy-rc.d denied execution of restart.
Setting up libtry-tiny-perl (0.31-1) ...
Setting up libmagic1:amd64 (1:5.41-4) ...
Setting up libdeflate0:amd64 (1.12-1) ...
Setting up perl-openssl-defaults:amd64 (7+b1) ...
Setting up gettext-base (0.21-9) ...
Setting up m4 (1.4.19-1) ...
Setting up libencode-locale-perl (1.05-2) ...
Setting up libnpth0:amd64 (1.6-3) ...
Setting up libxcb-shm0:amd64 (1.15-1) ...
Setting up file (1:5.41-4) ...
Setting up libassuan0:amd64 (2.5.5-4) ...
Setting up gem2deb-test-runner (2.0.3) ...
Setting up libjbig0:amd64 (2.1-3.1+b2) ...
Setting up libsasl2-modules-db:amd64 (2.1.28+dfsg-8) ...
Setting up libgts-0.7-5:amd64 (0.7.6+darcs121130-5) ...
Setting up autotools-dev (20220109.1) ...
Setting up libjpeg62-turbo:amd64 (1:2.1.2-1) ...
Setting up libx11-data (2:1.8.1-2) ...
Setting up gnupg-l10n (2.2.39-1) ...
Setting up libpathplan4:amd64 (2.42.2-7) ...
Setting up libann0 (1.1.2+doc-8+b1) ...
Setting up libfribidi0:amd64 (1.0.8-2.1) ...
Setting up libpng16-16:amd64 (1.6.37-5) ...
Setting up libio-html-perl (1.004-3) ...
Setting up autopoint (0.21-9) ...
Setting up libb-hooks-op-check-perl:amd64 (0.22-2) ...
Setting up fonts-dejavu-core (2.37-2) ...
Setting up libipc-run-perl (20220807.0-1) ...
Setting up libncursesw6:amd64 (6.3+20220423-2) ...
Setting up libltdl7:amd64 (2.4.7-4) ...
Setting up libsasl2-2:amd64 (2.1.28+dfsg-8) ...
Setting up autoconf (2.71-2) ...
Setting up libwebp7:amd64 (1.2.2-2+b1) ...
Setting up libtimedate-perl (2.3300-2) ...
Setting up libregexp-ipv6-perl (0.03-3) ...
Setting up sensible-utils (0.0.17) ...
Setting up libuchardet0:amd64 (0.0.7-1) ...
Setting up libmpdec3:amd64 (2.5.1-2) ...
Setting up librole-tiny-perl (2.002004-1) ...
Setting up libsub-override-perl (0.09-3) ...
Setting up libx11-6:amd64 (2:1.8.1-2) ...
Setting up libthai-data (0.1.29-1) ...
Setting up netbase (6.3) ...
Setting up libsub-quote-perl (2.006006-1) ...
Setting up libclass-xsaccessor-perl (1.19-4) ...
Setting up libcdt5:amd64 (2.42.2-7) ...
Setting up libcgraph6:amd64 (2.42.2-7) ...
Setting up libtiff5:amd64 (4.4.0-4) ...
Setting up libfile-dirlist-perl (0.05-2) ...
Setting up libfile-homedir-perl (1.006-1) ...
Setting up libelf1:amd64 (0.187-2) ...
Setting up readline-common (8.2~rc2-2) ...
Setting up libxml2:amd64 (2.9.14+dfsg-1+b1) ...
Setting up liburi-perl (5.12-1) ...
Setting up libfile-touch-perl (0.12-1) ...
Setting up libnet-ssleay-perl:amd64 (1.92-2) ...
Setting up automake (1:1.16.5-1.3) ...
update-alternatives: using /usr/bin/automake-1.16 to provide /usr/bin/automake (automake) in auto mode
Setting up pinentry-curses (1.2.0-2) ...
Setting up libfile-stripnondeterminism-perl (1.13.0-1) ...
Setting up libice6:amd64 (2:1.0.10-1) ...
Setting up libhttp-date-perl (6.05-2) ...
Setting up gettext (0.21-9) ...
Setting up libfile-listing-perl (6.15-1) ...
Setting up libxpm4:amd64 (1:3.5.12-1) ...
Setting up libxrender1:amd64 (1:0.9.10-1.1) ...
Setting up libtool (2.4.7-4) ...
Setting up libreadline8:amd64 (8.2~rc2-2) ...
Setting up libxext6:amd64 (2:1.3.4-1) ...
Setting up libnet-http-perl (6.22-1) ...
Setting up libdevel-callchecker-perl (0.008-1+b3) ...
Setting up libldap-2.5-0:amd64 (2.5.12+dfsg-2+b1) ...
Setting up intltool-debian (0.35.0+20060710.5) ...
Setting up libpython3.10-stdlib:amd64 (3.10.7-1) ...
Setting up dh-autoreconf (20) ...
Setting up patchutils (0.4.2-1) ...
Setting up libthai0:amd64 (0.1.29-1) ...
Setting up libfreetype6:amd64 (2.12.1+dfsg-3) ...
Setting up ucf (3.0043) ...
Setting up dh-strip-nondeterminism (1.13.0-1) ...
Setting up libwww-robotrules-perl (6.02-1) ...
Setting up libgvpr2:amd64 (2.42.2-7) ...
Setting up dwz (0.14-1) ...
Setting up groff-base (1.22.4-8) ...
Setting up libhtml-parser-perl:amd64 (3.78-1) ...
Setting up gpgconf (2.2.39-1) ...
Setting up libharfbuzz0b:amd64 (2.7.4-1+b1) ...
Setting up libsm6:amd64 (2:1.2.3-1) ...
Setting up libio-socket-ssl-perl (2.075-1) ...
Setting up gpg (2.2.39-1) ...
Setting up libpython3-stdlib:amd64 (3.10.6-1) ...
Setting up gnupg-utils (2.2.39-1) ...
Setting up libhttp-message-perl (6.37-1) ...
Setting up libhttp-negotiate-perl (6.01-1) ...
Setting up gpg-agent (2.2.39-1) ...
Setting up python3.10 (3.10.7-1) ...
Setting up libhttp-cookies-perl (6.10-1) ...
Setting up fontconfig-config (2.13.1-4.4) ...
Setting up po-debconf (1.0.21+nmu1) ...
Setting up libhtml-tree-perl (5.07-2) ...
Setting up libparams-classify-perl:amd64 (0.015-2) ...
Setting up gpgsm (2.2.39-1) ...
Setting up python3 (3.10.6-1) ...
Setting up man-db (2.10.2-3) ...
Not building database; man-db/auto-update is not 'true'.
Setting up dirmngr (2.2.39-1) ...
Setting up libmodule-runtime-perl (0.016-2) ...
Setting up libxt6:amd64 (1:1.2.1-1) ...
Setting up gpg-wks-server (2.2.39-1) ...
Setting up libxmu6:amd64 (2:1.1.3-3) ...
Setting up gpg-wks-client (2.2.39-1) ...
Setting up libimport-into-perl (1.002005-2) ...
Setting up libmoo-perl (2.005004-3) ...
Setting up debhelper (13.9.1) ...
Setting up libxaw7:amd64 (2:1.0.14-1) ...
Setting up gnupg (2.2.39-1) ...
Setting up liblwp-protocol-https-perl (6.10-1) ...
Setting up libwww-perl (6.67-1) ...
Setting up devscripts (2.22.2) ...
Setting up gem2deb (2.0.3) ...
Processing triggers for libc-bin (2.34-8) ...
Processing triggers for sgml-base (1.30) ...
Setting up libfontconfig1:amd64 (2.13.1-4.4) ...
Setting up fontconfig (2.13.1-4.4) ...
Regenerating fonts cache... done.
Setting up libpango-1.0-0:amd64 (1.50.9+ds-1) ...
Setting up libcairo2:amd64 (1.16.0-6) ...
Setting up libgd3:amd64 (2.3.3-6) ...
Setting up libpangoft2-1.0-0:amd64 (1.50.9+ds-1) ...
Setting up libpangocairo-1.0-0:amd64 (1.50.9+ds-1) ...
Setting up libgvc6 (2.42.2-7) ...
Setting up graphviz (2.42.2-7) ...
Setting up sbuild-build-depends-main-dummy (0.invalid.0) ...
Processing triggers for libc-bin (2.34-8) ...

+------------------------------------------------------------------------------+
| Check architectures                                                          |
+------------------------------------------------------------------------------+

Arch check ok (amd64 included in all)

+------------------------------------------------------------------------------+
| Build environment                                                            |
+------------------------------------------------------------------------------+

Kernel: Linux 5.10.0-16-cloud-amd64 #1 SMP Debian 5.10.127-1 (2022-06-30) amd64 (x86_64)
Toolchain package versions: binutils_2.38.90.20220713-2 dpkg-dev_1.21.9 g++-11_11.3.0-6 g++-12_12.2.0-2 gcc-11_11.3.0-6 gcc-12_12.2.0-2 libc6-dev_2.34-8 libstdc++-11-dev_11.3.0-6 libstdc++-12-dev_12.2.0-2 libstdc++6_12.2.0-2 linux-libc-dev_5.19.6-1
Package versions: adduser_3.129 apt_2.5.2 auto-apt-proxy_14 autoconf_2.71-2 automake_1:1.16.5-1.3 autopoint_0.21-9 autotools-dev_20220109.1 base-files_12.2 base-passwd_3.6.0 bash_5.2~rc2-2 binutils_2.38.90.20220713-2 binutils-common_2.38.90.20220713-2 binutils-x86-64-linux-gnu_2.38.90.20220713-2 bsdextrautils_2.38.1-1 bsdutils_1:2.38.1-1 build-essential_12.9 bzip2_1.0.8-5 ca-certificates_20211016 coreutils_8.32-4.1 cpp_4:12.2.0-1 cpp-11_11.3.0-6 cpp-12_12.2.0-2 dash_0.5.11+git20210903+057cd650a4ed-9 debconf_1.5.79 debhelper_13.9.1 debian-archive-keyring_2021.1.1 debianutils_5.7-0.3 devscripts_2.22.2 dh-autoreconf_20 dh-strip-nondeterminism_1.13.0-1 diffutils_1:3.8-1 dirmngr_2.2.39-1 dpkg_1.21.9 dpkg-dev_1.21.9 dwz_0.14-1 e2fsprogs_1.46.5-2 fakeroot_1.29-1 file_1:5.41-4 findutils_4.9.0-3 fontconfig_2.13.1-4.4 fontconfig-config_2.13.1-4.4 fonts-dejavu-core_2.37-2 g++_4:12.2.0-1 g++-11_11.3.0-6 g++-12_12.2.0-2 gcc_4:12.2.0-1 gcc-11_11.3.0-6 gcc-11-base_11.3.0-6 gcc-12_12.2.0-2 gcc-12-base_12.2.0-2 gcc-9-base_9.5.0-2 gem2deb_2.0.3 gem2deb-test-runner_2.0.3 gettext_0.21-9 gettext-base_0.21-9 gnupg_2.2.39-1 gnupg-l10n_2.2.39-1 gnupg-utils_2.2.39-1 gpg_2.2.39-1 gpg-agent_2.2.39-1 gpg-wks-client_2.2.39-1 gpg-wks-server_2.2.39-1 gpgconf_2.2.39-1 gpgsm_2.2.39-1 gpgv_2.2.39-1 graphviz_2.42.2-7 grep_3.8-2 groff-base_1.22.4-8 gzip_1.12-1 hostname_3.23 init-system-helpers_1.64 intltool-debian_0.35.0+20060710.5 libacl1_2.3.1-1 libann0_1.1.2+doc-8+b1 libapt-pkg6.0_2.5.2 libarchive-zip-perl_1.68-1 libasan6_11.3.0-6 libasan8_12.2.0-2 libassuan0_2.5.5-4 libatomic1_12.2.0-2 libattr1_1:2.5.1-1 libaudit-common_1:3.0.7-1 libaudit1_1:3.0.7-1+b1 libb-hooks-op-check-perl_0.22-2 libbinutils_2.38.90.20220713-2 libblkid1_2.38.1-1 libbrotli1_1.0.9-2+b4 libbsd0_0.11.6-1 libbz2-1.0_1.0.8-5 libc-bin_2.34-8 libc-dev-bin_2.34-8 libc6_2.34-8 libc6-dev_2.34-8 libcairo2_1.16.0-6 libcap-ng0_0.8.3-1+b1 libcap2_1:2.44-1 libcc1-0_12.2.0-2 libcdt5_2.42.2-7 libcgraph6_2.42.2-7 libclass-method-modifiers-perl_2.13-2 libclass-xsaccessor-perl_1.19-4 libcom-err2_1.46.5-2 libcrypt-dev_1:4.4.28-2 libcrypt1_1:4.4.28-2 libctf-nobfd0_2.38.90.20220713-2 libctf0_2.38.90.20220713-2 libdatrie1_0.2.13-2 libdb5.3_5.3.28+dfsg1-0.10 libdebconfclient0_0.264 libdebhelper-perl_13.9.1 libdeflate0_1.12-1 libdevel-callchecker-perl_0.008-1+b3 libdpkg-perl_1.21.9 libdynaloader-functions-perl_0.003-2 libedit2_3.1-20210910-1 libelf1_0.187-2 libencode-locale-perl_1.05-2 libexpat1_2.4.8-1 libext2fs2_1.46.5-2 libfakeroot_1.29-1 libffi8_3.4.2-4 libfile-dirlist-perl_0.05-2 libfile-homedir-perl_1.006-1 libfile-listing-perl_6.15-1 libfile-stripnondeterminism-perl_1.13.0-1 libfile-touch-perl_0.12-1 libfile-which-perl_1.27-1 libfontconfig1_2.13.1-4.4 libfreetype6_2.12.1+dfsg-3 libfribidi0_1.0.8-2.1 libgcc-11-dev_11.3.0-6 libgcc-12-dev_12.2.0-2 libgcc-s1_12.2.0-2 libgcrypt20_1.10.1-2 libgd3_2.3.3-6 libgdbm-compat4_1.23-2 libgdbm6_1.23-2 libglib2.0-0_2.73.3-3 libgmp-dev_2:6.2.1+dfsg1-1 libgmp10_2:6.2.1+dfsg1-1 libgmpxx4ldbl_2:6.2.1+dfsg1-1 libgnutls30_3.7.7-2 libgomp1_12.2.0-2 libgpg-error0_1.45-2 libgprofng0_2.38.90.20220713-2 libgraphite2-3_1.3.14-1 libgssapi-krb5-2_1.20-1 libgts-0.7-5_0.7.6+darcs121130-5 libgvc6_2.42.2-7 libgvpr2_2.42.2-7 libharfbuzz0b_2.7.4-1+b1 libhogweed6_3.8.1-2 libhtml-parser-perl_3.78-1 libhtml-tagset-perl_3.20-5 libhtml-tree-perl_5.07-2 libhttp-cookies-perl_6.10-1 libhttp-date-perl_6.05-2 libhttp-message-perl_6.37-1 libhttp-negotiate-perl_6.01-1 libice6_2:1.0.10-1 libicu71_71.1-3 libidn2-0_2.3.3-1+b1 libimport-into-perl_1.002005-2 libio-html-perl_1.004-3 libio-pty-perl_1:1.15-2+b1 libio-socket-ssl-perl_2.075-1 libipc-run-perl_20220807.0-1 libisl23_0.25-1 libitm1_12.2.0-2 libjbig0_2.1-3.1+b2 libjpeg62-turbo_1:2.1.2-1 libk5crypto3_1.20-1 libkeyutils1_1.6.3-1 libkrb5-3_1.20-1 libkrb5support0_1.20-1 libksba8_1.6.0-3 liblab-gamut1_2.42.2-7 libldap-2.5-0_2.5.12+dfsg-2+b1 liblerc4_4.0.0+ds-1 liblsan0_12.2.0-2 libltdl7_2.4.7-4 liblwp-mediatypes-perl_6.04-1 liblwp-protocol-https-perl_6.10-1 liblz4-1_1.9.4-1 liblzma5_5.2.5-2.1 libmagic-mgc_1:5.41-4 libmagic1_1:5.41-4 libmd0_1.0.4-2 libmodule-runtime-perl_0.016-2 libmoo-perl_2.005004-3 libmount1_2.38.1-1 libmpc3_1.2.1-2 libmpdec3_2.5.1-2 libmpfr6_4.1.0-3 libncurses6_6.3+20220423-2 libncursesw6_6.3+20220423-2 libnet-http-perl_6.22-1 libnet-ssleay-perl_1.92-2 libnettle8_3.8.1-2 libnpth0_1.6-3 libnsl-dev_1.3.0-2 libnsl2_1.3.0-2 libp11-kit0_0.24.1-1 libpam-modules_1.5.2-2 libpam-modules-bin_1.5.2-2 libpam-runtime_1.5.2-2 libpam0g_1.5.2-2 libpango-1.0-0_1.50.9+ds-1 libpangocairo-1.0-0_1.50.9+ds-1 libpangoft2-1.0-0_1.50.9+ds-1 libparams-classify-perl_0.015-2 libpathplan4_2.42.2-7 libpcre2-8-0_10.40-1 libpcre3_2:8.39-14 libperl5.34_5.34.0-5 libpipeline1_1.5.6-2 libpixman-1-0_0.40.0-1 libpng16-16_1.6.37-5 libpython3-stdlib_3.10.6-1 libpython3.10-minimal_3.10.7-1 libpython3.10-stdlib_3.10.7-1 libquadmath0_12.2.0-2 libreadline8_8.2~rc2-2 libregexp-ipv6-perl_0.03-3 librole-tiny-perl_2.002004-1 libruby3.0_3.0.4-8 libruby3.1_3.1.2-3 libsasl2-2_2.1.28+dfsg-8 libsasl2-modules-db_2.1.28+dfsg-8 libseccomp2_2.5.4-1+b1 libselinux1_3.4-1+rebuild1662921302 libsemanage-common_3.4-1+rebuild1662931153 libsemanage2_3.4-1+rebuild1662931153 libsepol2_3.4-2 libsm6_2:1.2.3-1 libsmartcols1_2.38.1-1 libsqlite3-0_3.39.3-1 libss2_1.46.5-2 libssl3_3.0.5-2 libstdc++-11-dev_11.3.0-6 libstdc++-12-dev_12.2.0-2 libstdc++6_12.2.0-2 libsub-override-perl_0.09-3 libsub-quote-perl_2.006006-1 libsystemd0_251.4-3 libtasn1-6_4.19.0-2 libthai-data_0.1.29-1 libthai0_0.1.29-1 libtiff5_4.4.0-4 libtimedate-perl_2.3300-2 libtinfo6_6.3+20220423-2 libtirpc-common_1.3.3+ds-1 libtirpc-dev_1.3.3+ds-1 libtirpc3_1.3.3+ds-1 libtool_2.4.7-4 libtry-tiny-perl_0.31-1 libtsan0_11.3.0-6 libtsan2_12.2.0-2 libubsan1_12.2.0-2 libuchardet0_0.0.7-1 libudev1_251.4-3 libunistring2_1.0-1 liburi-perl_5.12-1 libuuid1_2.38.1-1 libwebp7_1.2.2-2+b1 libwww-perl_6.67-1 libwww-robotrules-perl_6.02-1 libx11-6_2:1.8.1-2 libx11-data_2:1.8.1-2 libxau6_1:1.0.9-1 libxaw7_2:1.0.14-1 libxcb-render0_1.15-1 libxcb-shm0_1.15-1 libxcb1_1.15-1 libxdmcp6_1:1.1.2-3 libxext6_2:1.3.4-1 libxml2_2.9.14+dfsg-1+b1 libxmu6_2:1.1.3-3 libxpm4_1:3.5.12-1 libxrender1_1:0.9.10-1.1 libxt6_1:1.2.1-1 libxxhash0_0.8.1-1 libyaml-0-2_0.2.5-1 libzstd1_1.5.2+dfsg-1 linux-libc-dev_5.19.6-1 login_1:4.11.1+dfsg1-2 logsave_1.46.5-2 m4_1.4.19-1 make_4.3-4.1 man-db_2.10.2-3 mawk_1.3.4.20200120-3.1 media-types_8.0.0 mount_2.38.1-1 ncurses-base_6.3+20220423-2 ncurses-bin_6.3+20220423-2 netbase_6.3 openssl_3.0.5-2 passwd_1:4.11.1+dfsg1-2 patch_2.7.6-7 patchutils_0.4.2-1 perl_5.34.0-5 perl-base_5.34.0-5 perl-modules-5.34_5.34.0-5 perl-openssl-defaults_7+b1 pinentry-curses_1.2.0-2 po-debconf_1.0.21+nmu1 python3_3.10.6-1 python3-minimal_3.10.6-1 python3.10_3.10.7-1 python3.10-minimal_3.10.7-1 rake_13.0.6-3+rebuild1658446070 readline-common_8.2~rc2-2 rpcsvc-proto_1.4.2-4 ruby_1:3.0+2 ruby-all-dev_1:3.0+2 ruby-net-telnet_0.1.1-2.1+rebuild1658450759 ruby-rubygems_3.3.15-1 ruby-sdbm_1.0.0-4+rebuild1662922876 ruby-webrick_1.7.0-4 ruby-xmlrpc_0.3.2-2+rebuild1658454438 ruby3.0_3.0.4-8 ruby3.0-dev_3.0.4-8 ruby3.1_3.1.2-3 ruby3.1-dev_3.1.2-3 rubygems-integration_1.18 sbuild-build-depends-main-dummy_0.invalid.0 sed_4.8-1 sensible-utils_0.0.17 sgml-base_1.30 sysvinit-utils_3.05-3 tar_1.34+dfsg-1 tzdata_2022c-1 ucf_3.0043 util-linux_2.38.1-1 util-linux-extra_2.38.1-1 wdiff_1.2.2-2+b1 x11-common_1:7.7+23 xz-utils_5.2.5-2.1 zlib1g_1:1.2.11.dfsg-4.1

+------------------------------------------------------------------------------+
| Build                                                                        |
+------------------------------------------------------------------------------+


Unpack source
-------------

Format: 3.0 (quilt)
Source: ruby-graphviz
Binary: ruby-graphviz
Architecture: all
Version: 1.2.5-2+rebuild1663007659
Maintainer: Debian Ruby Extras Maintainers <pkg-ruby-extras-maintainers@lists.alioth.debian.org>
Uploaders: Praveen Arimbrathodiyil <praveen@debian.org>
Homepage: https://github.com/glejeune/Ruby-Graphviz
Standards-Version: 4.5.0
Vcs-Browser: https://salsa.debian.org/ruby-team/ruby-graphviz
Vcs-Git: https://salsa.debian.org/ruby-team/ruby-graphviz.git
Testsuite: autopkgtest-pkg-ruby
Build-Depends: debhelper-compat (= 12), gem2deb, graphviz
Package-List:
 ruby-graphviz deb ruby optional arch=all
Checksums-Sha1:
 2f0155240e534740a602320cfde6271434cf21e3 118101 ruby-graphviz_1.2.5.orig.tar.gz
 40d9e6e56ed87bc89714beb192c0f088b6276b00 5736 ruby-graphviz_1.2.5-2+rebuild1663007659.debian.tar.xz
Checksums-Sha256:
 a98038ea7f8ecfca0e89962d98bd613999a13afb006bad31bd9c4f02c3618a28 118101 ruby-graphviz_1.2.5.orig.tar.gz
 f3b529d9a4264647bedd7a2b3ae2850bc4e1fe19f61c3580a619171d0ca0e435 5736 ruby-graphviz_1.2.5-2+rebuild1663007659.debian.tar.xz
Files:
 82938cac5e8eecb06d22b143c87b0661 118101 ruby-graphviz_1.2.5.orig.tar.gz
 b935d79914c78a7f3b097e090d0f79d2 5736 ruby-graphviz_1.2.5-2+rebuild1663007659.debian.tar.xz
Ruby-Versions: all

dpkg-source: warning: extracting unsigned source package (ruby-graphviz_1.2.5-2+rebuild1663007659.dsc)
dpkg-source: info: extracting ruby-graphviz in /<<PKGBUILDDIR>>
dpkg-source: info: unpacking ruby-graphviz_1.2.5.orig.tar.gz
dpkg-source: info: unpacking ruby-graphviz_1.2.5-2+rebuild1663007659.debian.tar.xz
dpkg-source: info: using patch list from debian/patches/series
dpkg-source: info: applying clean_test_helper.patch
dpkg-source: info: applying remove_git_from_gemspec.patch

Check disk space
----------------

Sufficient free space for build

User Environment
----------------

APT_CONFIG=/var/lib/sbuild/apt.conf
HOME=/sbuild-nonexistent
LANG=C.UTF-8
LC_ALL=C.UTF-8
LOGNAME=admin
PATH=/usr/local/sbin:/usr/local/bin:/usr/sbin:/usr/bin:/sbin:/bin:/usr/games
SCHROOT_ALIAS_NAME=experimental-amd64-mass-rebuild
SCHROOT_CHROOT_NAME=experimental-amd64-mass-rebuild
SCHROOT_COMMAND=env
SCHROOT_GID=1000
SCHROOT_GROUP=admin
SCHROOT_SESSION_ID=experimental-amd64-mass-rebuild-ace6254a-e314-43bb-86dd-d96c1677c778
SCHROOT_UID=1000
SCHROOT_USER=admin
SHELL=/bin/sh
USER=admin

dpkg-buildpackage
-----------------

Command: dpkg-buildpackage --sanitize-env -us -uc -mAutomated rebuild <nobody@debian.org> -b -rfakeroot
dpkg-buildpackage: info: source package ruby-graphviz
dpkg-buildpackage: info: source version 1.2.5-2+rebuild1663007659
dpkg-buildpackage: info: source distribution UNRELEASED
 dpkg-source --before-build .
dpkg-buildpackage: info: host architecture amd64
 debian/rules clean
dh clean --buildsystem=ruby --with ruby
   dh_auto_clean -O--buildsystem=ruby
	dh_ruby --clean
   dh_autoreconf_clean -O--buildsystem=ruby
   dh_clean -O--buildsystem=ruby
rm -rf test/output
 debian/rules binary
dh binary --buildsystem=ruby --with ruby
   debian/rules build
make[1]: Entering directory '/<<PKGBUILDDIR>>'
dh build --buildsystem=ruby --with ruby
   dh_update_autotools_config -O--buildsystem=ruby
   dh_autoreconf -O--buildsystem=ruby
   dh_auto_configure -O--buildsystem=ruby
	dh_ruby --configure
   dh_auto_build -O--buildsystem=ruby
	dh_ruby --build
   dh_auto_test -O--buildsystem=ruby
	dh_ruby --test
   create-stamp debian/debhelper-build-stamp
make[1]: Leaving directory '/<<PKGBUILDDIR>>'
   dh_testroot -O--buildsystem=ruby
   dh_prep -O--buildsystem=ruby
   dh_auto_install --destdir=debian/ruby-graphviz/ -O--buildsystem=ruby
	dh_ruby --install /<<PKGBUILDDIR>>/debian/ruby-graphviz
/usr/bin/ruby3.0 -S gem build --config-file /dev/null --verbose /tmp/d20220912-3543805-2elhqu/gemspec
Failed to load /dev/null because it doesn't contain valid YAML hash
WARNING:  open-ended dependency on rexml (>= 0) is not recommended
  use a bounded requirement, such as '~> x.y'
WARNING:  open-ended dependency on rake (>= 0, development) is not recommended
  use a bounded requirement, such as '~> x.y'
WARNING:  open-ended dependency on rdoc (>= 0, development) is not recommended
  use a bounded requirement, such as '~> x.y'
WARNING:  open-ended dependency on yard (>= 0, development) is not recommended
  use a bounded requirement, such as '~> x.y'
WARNING:  open-ended dependency on github_changelog_generator (>= 0, development) is not recommended
  use a bounded requirement, such as '~> x.y'
WARNING:  open-ended dependency on bundler (>= 0, development) is not recommended
  use a bounded requirement, such as '~> x.y'
WARNING:  open-ended dependency on ronn (>= 0, development) is not recommended
  use a bounded requirement, such as '~> x.y'
WARNING:  open-ended dependency on test-unit (>= 0, development) is not recommended
  use a bounded requirement, such as '~> x.y'
WARNING:  See https://guides.rubygems.org/specification-reference/ for help
  Successfully built RubyGem
  Name: ruby-graphviz
  Version: 1.2.5
  File: ruby-graphviz-1.2.5.gem
/usr/bin/ruby3.0 -S gem install --config-file /dev/null --verbose --local --verbose --no-document --ignore-dependencies --install-dir debian/ruby-graphviz/usr/share/rubygems-integration/all /tmp/d20220912-3543805-2elhqu/ruby-graphviz-1.2.5.gem
Failed to load /dev/null because it doesn't contain valid YAML hash
/<<PKGBUILDDIR>>/debian/ruby-graphviz/usr/share/rubygems-integration/all/gems/ruby-graphviz-1.2.5/bin/dot2ruby
/<<PKGBUILDDIR>>/debian/ruby-graphviz/usr/share/rubygems-integration/all/gems/ruby-graphviz-1.2.5/bin/gem2gv
/<<PKGBUILDDIR>>/debian/ruby-graphviz/usr/share/rubygems-integration/all/gems/ruby-graphviz-1.2.5/bin/git2gv
/<<PKGBUILDDIR>>/debian/ruby-graphviz/usr/share/rubygems-integration/all/gems/ruby-graphviz-1.2.5/bin/ruby2gv
/<<PKGBUILDDIR>>/debian/ruby-graphviz/usr/share/rubygems-integration/all/gems/ruby-graphviz-1.2.5/bin/xml2gv
/<<PKGBUILDDIR>>/debian/ruby-graphviz/usr/share/rubygems-integration/all/gems/ruby-graphviz-1.2.5/lib/ext/gvpr/dot2ruby.g
/<<PKGBUILDDIR>>/debian/ruby-graphviz/usr/share/rubygems-integration/all/gems/ruby-graphviz-1.2.5/lib/graphviz.rb
/<<PKGBUILDDIR>>/debian/ruby-graphviz/usr/share/rubygems-integration/all/gems/ruby-graphviz-1.2.5/lib/graphviz/attrs.rb
/<<PKGBUILDDIR>>/debian/ruby-graphviz/usr/share/rubygems-integration/all/gems/ruby-graphviz-1.2.5/lib/graphviz/constants.rb
/<<PKGBUILDDIR>>/debian/ruby-graphviz/usr/share/rubygems-integration/all/gems/ruby-graphviz-1.2.5/lib/graphviz/core_ext.rb
/<<PKGBUILDDIR>>/debian/ruby-graphviz/usr/share/rubygems-integration/all/gems/ruby-graphviz-1.2.5/lib/graphviz/dot2ruby.rb
/<<PKGBUILDDIR>>/debian/ruby-graphviz/usr/share/rubygems-integration/all/gems/ruby-graphviz-1.2.5/lib/graphviz/dot_script.rb
/<<PKGBUILDDIR>>/debian/ruby-graphviz/usr/share/rubygems-integration/all/gems/ruby-graphviz-1.2.5/lib/graphviz/dsl.rb
/<<PKGBUILDDIR>>/debian/ruby-graphviz/usr/share/rubygems-integration/all/gems/ruby-graphviz-1.2.5/lib/graphviz/edge.rb
/<<PKGBUILDDIR>>/debian/ruby-graphviz/usr/share/rubygems-integration/all/gems/ruby-graphviz-1.2.5/lib/graphviz/elements.rb
/<<PKGBUILDDIR>>/debian/ruby-graphviz/usr/share/rubygems-integration/all/gems/ruby-graphviz-1.2.5/lib/graphviz/ext.rb
/<<PKGBUILDDIR>>/debian/ruby-graphviz/usr/share/rubygems-integration/all/gems/ruby-graphviz-1.2.5/lib/graphviz/family_tree.rb
/<<PKGBUILDDIR>>/debian/ruby-graphviz/usr/share/rubygems-integration/all/gems/ruby-graphviz-1.2.5/lib/graphviz/family_tree/couple.rb
/<<PKGBUILDDIR>>/debian/ruby-graphviz/usr/share/rubygems-integration/all/gems/ruby-graphviz-1.2.5/lib/graphviz/family_tree/generation.rb
/<<PKGBUILDDIR>>/debian/ruby-graphviz/usr/share/rubygems-integration/all/gems/ruby-graphviz-1.2.5/lib/graphviz/family_tree/person.rb
/<<PKGBUILDDIR>>/debian/ruby-graphviz/usr/share/rubygems-integration/all/gems/ruby-graphviz-1.2.5/lib/graphviz/family_tree/sibling.rb
/<<PKGBUILDDIR>>/debian/ruby-graphviz/usr/share/rubygems-integration/all/gems/ruby-graphviz-1.2.5/lib/graphviz/graphml.rb
/<<PKGBUILDDIR>>/debian/ruby-graphviz/usr/share/rubygems-integration/all/gems/ruby-graphviz-1.2.5/lib/graphviz/math/matrix.rb
/<<PKGBUILDDIR>>/debian/ruby-graphviz/usr/share/rubygems-integration/all/gems/ruby-graphviz-1.2.5/lib/graphviz/node.rb
/<<PKGBUILDDIR>>/debian/ruby-graphviz/usr/share/rubygems-integration/all/gems/ruby-graphviz-1.2.5/lib/graphviz/nothugly.rb
/<<PKGBUILDDIR>>/debian/ruby-graphviz/usr/share/rubygems-integration/all/gems/ruby-graphviz-1.2.5/lib/graphviz/nothugly/nothugly.xsl
/<<PKGBUILDDIR>>/debian/ruby-graphviz/usr/share/rubygems-integration/all/gems/ruby-graphviz-1.2.5/lib/graphviz/theory.rb
/<<PKGBUILDDIR>>/debian/ruby-graphviz/usr/share/rubygems-integration/all/gems/ruby-graphviz-1.2.5/lib/graphviz/types.rb
/<<PKGBUILDDIR>>/debian/ruby-graphviz/usr/share/rubygems-integration/all/gems/ruby-graphviz-1.2.5/lib/graphviz/types/arrow_type.rb
/<<PKGBUILDDIR>>/debian/ruby-graphviz/usr/share/rubygems-integration/all/gems/ruby-graphviz-1.2.5/lib/graphviz/types/color.rb
/<<PKGBUILDDIR>>/debian/ruby-graphviz/usr/share/rubygems-integration/all/gems/ruby-graphviz-1.2.5/lib/graphviz/types/color_list.rb
/<<PKGBUILDDIR>>/debian/ruby-graphviz/usr/share/rubygems-integration/all/gems/ruby-graphviz-1.2.5/lib/graphviz/types/esc_string.rb
/<<PKGBUILDDIR>>/debian/ruby-graphviz/usr/share/rubygems-integration/all/gems/ruby-graphviz-1.2.5/lib/graphviz/types/gv_bool.rb
/<<PKGBUILDDIR>>/debian/ruby-graphviz/usr/share/rubygems-integration/all/gems/ruby-graphviz-1.2.5/lib/graphviz/types/gv_double.rb
/<<PKGBUILDDIR>>/debian/ruby-graphviz/usr/share/rubygems-integration/all/gems/ruby-graphviz-1.2.5/lib/graphviz/types/html_string.rb
/<<PKGBUILDDIR>>/debian/ruby-graphviz/usr/share/rubygems-integration/all/gems/ruby-graphviz-1.2.5/lib/graphviz/types/lbl_string.rb
/<<PKGBUILDDIR>>/debian/ruby-graphviz/usr/share/rubygems-integration/all/gems/ruby-graphviz-1.2.5/lib/graphviz/types/rect.rb
/<<PKGBUILDDIR>>/debian/ruby-graphviz/usr/share/rubygems-integration/all/gems/ruby-graphviz-1.2.5/lib/graphviz/types/spline_type.rb
/<<PKGBUILDDIR>>/debian/ruby-graphviz/usr/share/rubygems-integration/all/gems/ruby-graphviz-1.2.5/lib/graphviz/utils.rb
/<<PKGBUILDDIR>>/debian/ruby-graphviz/usr/share/rubygems-integration/all/gems/ruby-graphviz-1.2.5/lib/graphviz/utils/colors.rb
/<<PKGBUILDDIR>>/debian/ruby-graphviz/usr/share/rubygems-integration/all/gems/ruby-graphviz-1.2.5/lib/graphviz/xml.rb
/<<PKGBUILDDIR>>/debian/ruby-graphviz/usr/share/rubygems-integration/all/gems/ruby-graphviz-1.2.5/lib/ruby-graphviz.rb
/<<PKGBUILDDIR>>/debian/ruby-graphviz/usr/share/rubygems-integration/all/bin/dot2ruby
/<<PKGBUILDDIR>>/debian/ruby-graphviz/usr/share/rubygems-integration/all/bin/gem2gv
/<<PKGBUILDDIR>>/debian/ruby-graphviz/usr/share/rubygems-integration/all/bin/git2gv
/<<PKGBUILDDIR>>/debian/ruby-graphviz/usr/share/rubygems-integration/all/bin/ruby2gv
/<<PKGBUILDDIR>>/debian/ruby-graphviz/usr/share/rubygems-integration/all/bin/xml2gv

You need to install GraphViz (https://graphviz.org) to use this Gem.

For more information about Ruby-Graphviz :
* Doc: https://rdoc.info/github/glejeune/Ruby-Graphviz
* Sources: https://github.com/glejeune/Ruby-Graphviz
* Issues: https://github.com/glejeune/Ruby-Graphviz/issues
  
Successfully installed ruby-graphviz-1.2.5
1 gem installed
mkdir -p debian/ruby-graphviz/usr/bin
mv debian/ruby-graphviz/usr/share/rubygems-integration/all/bin/dot2ruby debian/ruby-graphviz/usr/bin
mv debian/ruby-graphviz/usr/share/rubygems-integration/all/bin/gem2gv debian/ruby-graphviz/usr/bin
mv debian/ruby-graphviz/usr/share/rubygems-integration/all/bin/git2gv debian/ruby-graphviz/usr/bin
mv debian/ruby-graphviz/usr/share/rubygems-integration/all/bin/ruby2gv debian/ruby-graphviz/usr/bin
mv debian/ruby-graphviz/usr/share/rubygems-integration/all/bin/xml2gv debian/ruby-graphviz/usr/bin
cd debian/ruby-graphviz/usr/share/rubygems-integration/all
rm -rf bin
rm -rf build_info
rm -rf cache
rm -rf doc
rm -rf extensions
rmdir plugins
cd gems/ruby-graphviz-1.2.5
rm -f 
chmod 644 lib/graphviz/attrs.rb lib/graphviz/constants.rb lib/graphviz/core_ext.rb lib/graphviz/dot2ruby.rb lib/graphviz/dot_script.rb lib/graphviz/dsl.rb lib/graphviz/edge.rb lib/graphviz/elements.rb lib/graphviz/ext.rb lib/graphviz/family_tree/couple.rb lib/graphviz/family_tree/generation.rb lib/graphviz/family_tree/person.rb lib/graphviz/family_tree/sibling.rb lib/graphviz/family_tree.rb lib/graphviz/graphml.rb lib/graphviz/math/matrix.rb lib/graphviz/node.rb lib/graphviz/nothugly.rb lib/graphviz/theory.rb lib/graphviz/types/arrow_type.rb lib/graphviz/types/color.rb lib/graphviz/types/color_list.rb lib/graphviz/types/esc_string.rb lib/graphviz/types/gv_bool.rb lib/graphviz/types/gv_double.rb lib/graphviz/types/html_string.rb lib/graphviz/types/lbl_string.rb lib/graphviz/types/rect.rb lib/graphviz/types/spline_type.rb lib/graphviz/types.rb lib/graphviz/utils/colors.rb lib/graphviz/utils.rb lib/graphviz/xml.rb lib/graphviz.rb lib/ruby-graphviz.rb
find lib/ -type d -empty -delete
cd -
cd -
Rewriting shebang line of /<<PKGBUILDDIR>>/debian/ruby-graphviz/usr/bin/dot2ruby
Rewriting shebang line of /<<PKGBUILDDIR>>/debian/ruby-graphviz/usr/bin/gem2gv
Rewriting shebang line of /<<PKGBUILDDIR>>/debian/ruby-graphviz/usr/bin/git2gv
Rewriting shebang line of /<<PKGBUILDDIR>>/debian/ruby-graphviz/usr/bin/ruby2gv
Rewriting shebang line of /<<PKGBUILDDIR>>/debian/ruby-graphviz/usr/bin/xml2gv
dh_installchangelogs -pruby-graphviz /<<PKGBUILDDIR>>/CHANGELOG.md upstream
/usr/bin/ruby3.0 /usr/bin/gem2deb-test-runner

┌──────────────────────────────────────────────────────────────────────────────┐
│ Run tests for ruby3.0 from debian/ruby-tests.rake                            │
└──────────────────────────────────────────────────────────────────────────────┘

RUBYLIB=. GEM_PATH=/<<PKGBUILDDIR>>/debian/ruby-graphviz/usr/share/rubygems-integration/all:/var/lib/gems/3.0.0:/usr/local/lib/ruby/gems/3.0.0:/usr/lib/ruby/gems/3.0.0:/usr/lib/x86_64-linux-gnu/ruby/gems/3.0.0:/usr/share/rubygems-integration/3.0.0:/usr/share/rubygems-integration/all:/usr/lib/x86_64-linux-gnu/rubygems-integration/3.0.0 ruby3.0 -S rake -f debian/ruby-tests.rake
/usr/bin/ruby3.0 -w -I"test" /usr/share/rubygems-integration/all/gems/rake-13.0.6/lib/rake/rake_test_loader.rb "test/test_dot_script.rb" "test/test_examples.rb" "test/test_graph.rb" "test/test_search.rb" "test/test_subgraph.rb" "test/test_theory.rb" "test/test_types.rb" "test/test_utils_colors.rb" -v
skipping sample33 - FamilyTree is broken
skipping sample36 - hangs for me
skipping sample53 - FamilyTree is broken
skipping sample57 - will not be able to find the graphml script
skipping sample99 - FamilyTree is broken
Loaded suite /usr/share/rubygems-integration/all/gems/rake-13.0.6/lib/rake/rake_test_loader
Started
GraphVizDOTScriptTest: 
  test_appends_a_newline_character_if_it_is_missing:	.: (0.000151)
  test_can_add_types_with_data:				.: (0.000064)
  test_can_prepend_lines_to_its_content:		.: (0.000038)
  test_does_not_append_a_newline_if_already_present:	.: (0.000033)
  test_does_nothing_if_data_is_empty:			.: (0.000034)
  test_raises_an_argument_error_on_unknown_types:	.: (0.000070)
GraphVizSearch: 
  test_bfs:						.: (0.000376)
  test_dfs:						.: (0.000155)
GraphVizSubGraphTest: 
  test_subgraph:					.: (0.000322)
  test_to_graph:					.: (0.000176)
GraphVizTest: 
  test_getting_escaped_node_from_edge:			.: (0.000140)
  test_graph:						.: (0.000158)
  test_node:						.: (0.000087)
  test_sample01:					.: (0.140521)
  test_sample02:					.: (0.132639)
  test_sample03:					.: (0.124445)
  test_sample04:					.: (0.122655)
  test_sample05:					.: (0.141252)
  test_sample06:					.: (0.131933)
  test_sample07:					.: (0.121566)
  test_sample08:					.: (0.131981)
  test_sample09:					.: (0.133872)
  test_sample10:					.: (0.136312)
  test_sample11:					.: (0.152144)
  test_sample12:					.: (0.146793)
  test_sample13:					.: (0.153933)
  test_sample14:					.: (0.127607)
  test_sample15:					.: (0.143670)
  test_sample16:					.: (0.121156)
  test_sample17:					.: (0.173000)
  test_sample18:					.: (0.136118)
  test_sample19:					.: (0.134306)
  test_sample20:					.: (0.177043)
  test_sample21:					.: (0.130463)
  test_sample22:					.: (0.123761)
  test_sample23:					.: (0.118309)
  test_sample24:					.: (0.129160)
  test_sample25:					.: (0.131423)
  test_sample26:					.: (0.152042)
  test_sample27:					.: (0.105092)
  test_sample28:					.: (0.141376)
  test_sample29:					.: (0.116396)
  test_sample30:					.: (0.133969)
  test_sample31:					.: (0.123613)
  test_sample32:					.: (0.139349)
  test_sample34:					.: (0.126555)
  test_sample35:					.: (0.145296)
  test_sample37:					.: (0.150190)
  test_sample38:					.: (0.124488)
  test_sample39:					.: (0.121892)
  test_sample40:					.: (0.149151)
  test_sample41:					.: (0.132989)
  test_sample42:					.: (0.148733)
  test_sample43:					.: (0.133388)
  test_sample44:					.: (0.260352)
  test_sample45:					.: (0.194030)
  test_sample46:					.: (0.135471)
  test_sample47:					.: (0.243236)
  test_sample48:					.: (0.191201)
  test_sample49:					.: (0.129574)
  test_sample50:					.: (0.195373)
  test_sample51:					.: (0.151823)
  test_sample52:					.: (0.198149)
  test_sample54:					.: (0.153366)
  test_sample55:					.: (0.142817)
  test_sample56:					.: (0.150911)
  test_sample58:					.: (0.232776)
  test_sample59:					.: (0.125177)
  test_sample60:					.: (0.126794)
  test_sample61:					.: (0.122779)
  test_sample62:					.: (0.135150)
  test_sample63:					.: (0.139332)
  test_sample64:					.: (0.137610)
  test_sample65:					.: (0.116507)
  test_sample66:					.: (0.192431)
  test_sample67:					.: (0.126580)
  test_sample68:					.: (0.396254)
  test_sample69:					.: (0.123233)
  test_sample70:					.: (0.120222)
  test_sample71:					.: (0.131819)
  test_sample72:					.: (0.130613)
  test_sample73:					.: (0.142080)
  test_sample74:					.: (0.124862)
  test_search:						.: (0.000929)
  test_to_s:						.: (0.000274)
GraphVizTheoryTest: 
  test_adgency_matrix:					.: (0.001219)
  test_critical_path:					.: (0.001410)
  test_degree:						.: (0.000451)
  test_dijkstra_a_f:					.: (0.000434)
  test_escaped_node_ids__adjancy_matrix:		.: (0.000320)
  test_incidence_matrix:				.: (0.000694)
  test_laplacian_matrix:				.: (0.000837)
  test_range:						.: (0.001171)
  test_symetric:					.: (0.000515)
  test_theory:						.: (0.000291)
TypesTest: 
  test_color:						.: (0.000570)
  test_color_by_hsv:					.: (0.000172)
  test_color_by_name:					.: (0.000092)
  test_color_by_rgb:					.: (0.000130)
  test_gv_bool:						.: (0.000248)

Finished in 10.347247508 seconds.
-------------------------------------------------------------------------------
100 tests, 258 assertions, 0 failures, 0 errors, 0 pendings, 0 omissions, 0 notifications
100% passed
-------------------------------------------------------------------------------
9.66 tests/s, 24.93 assertions/s
/usr/bin/ruby3.1 /usr/bin/gem2deb-test-runner

┌──────────────────────────────────────────────────────────────────────────────┐
│ Run tests for ruby3.1 from debian/ruby-tests.rake                            │
└──────────────────────────────────────────────────────────────────────────────┘

RUBYLIB=. GEM_PATH=/<<PKGBUILDDIR>>/debian/ruby-graphviz/usr/share/rubygems-integration/all:/var/lib/gems/3.1.0:/usr/local/lib/ruby/gems/3.1.0:/usr/lib/ruby/gems/3.1.0:/usr/lib/x86_64-linux-gnu/ruby/gems/3.1.0:/usr/share/rubygems-integration/3.1.0:/usr/share/rubygems-integration/all:/usr/lib/x86_64-linux-gnu/rubygems-integration/3.1.0 ruby3.1 -S rake -f debian/ruby-tests.rake
/usr/bin/ruby3.1 -w -I"test" /usr/lib/ruby/gems/3.1.0/gems/rake-13.0.6/lib/rake/rake_test_loader.rb "test/test_dot_script.rb" "test/test_examples.rb" "test/test_graph.rb" "test/test_search.rb" "test/test_subgraph.rb" "test/test_theory.rb" "test/test_types.rb" "test/test_utils_colors.rb" -v
skipping sample33 - FamilyTree is broken
skipping sample36 - hangs for me
skipping sample53 - FamilyTree is broken
skipping sample57 - will not be able to find the graphml script
skipping sample99 - FamilyTree is broken
Loaded suite /usr/lib/ruby/gems/3.1.0/gems/rake-13.0.6/lib/rake/rake_test_loader
Started
GraphVizDOTScriptTest: 
  test_appends_a_newline_character_if_it_is_missing:	.: (0.000236)
  test_can_add_types_with_data:				.: (0.000097)
  test_can_prepend_lines_to_its_content:		.: (0.000058)
  test_does_not_append_a_newline_if_already_present:	.: (0.000050)
  test_does_nothing_if_data_is_empty:			.: (0.000051)
  test_raises_an_argument_error_on_unknown_types:	.: (0.000094)
GraphVizSearch: 
  test_bfs:						.: (0.000418)
  test_dfs:						.: (0.000187)
GraphVizSubGraphTest: 
  test_subgraph:					.: (0.000214)
  test_to_graph:					.: (0.000151)
GraphVizTest: 
  test_getting_escaped_node_from_edge:			.: (0.000189)
  test_graph:						.: (0.000130)
  test_node:						.: (0.000164)
  test_sample01:					F
===============================================================================
Failure: test_sample01(GraphVizTest):
  got exception on sample01.rb: expecting empty errorput got [Ignoring debug-1.4.0 because its extensions are not built. Try: gem pristine debug --version 1.4.0
  Ignoring rbs-2.1.0 because its extensions are not built. Try: gem pristine rbs --version 2.1.0
  Ignoring sdbm-1.0.0 because its extensions are not built. Try: gem pristine sdbm --version 1.0.0
  ].
  <0> expected but was
  <291>.
  <false> is not true.
/<<PKGBUILDDIR>>/test/test_examples.rb:120:in `rescue in assert_sample_file_has_no_output'
/<<PKGBUILDDIR>>/test/test_examples.rb:114:in `assert_sample_file_has_no_output'
/<<PKGBUILDDIR>>/test/test_examples.rb:92:in `block in make_sample_test_method'
===============================================================================
: (0.133813)
  test_sample02:					F
===============================================================================
Failure: test_sample02(GraphVizTest):
  got exception on sample02.rb: expecting empty errorput got [Ignoring debug-1.4.0 because its extensions are not built. Try: gem pristine debug --version 1.4.0
  Ignoring rbs-2.1.0 because its extensions are not built. Try: gem pristine rbs --version 2.1.0
  Ignoring sdbm-1.0.0 because its extensions are not built. Try: gem pristine sdbm --version 1.0.0
  ].
  <0> expected but was
  <291>.
  <false> is not true.
/<<PKGBUILDDIR>>/test/test_examples.rb:120:in `rescue in assert_sample_file_has_no_output'
/<<PKGBUILDDIR>>/test/test_examples.rb:114:in `assert_sample_file_has_no_output'
/<<PKGBUILDDIR>>/test/test_examples.rb:92:in `block in make_sample_test_method'
===============================================================================
: (0.175408)
  test_sample03:					F
===============================================================================
Failure: test_sample03(GraphVizTest):
  got exception on sample03.rb: expecting empty errorput got [Ignoring debug-1.4.0 because its extensions are not built. Try: gem pristine debug --version 1.4.0
  Ignoring rbs-2.1.0 because its extensions are not built. Try: gem pristine rbs --version 2.1.0
  Ignoring sdbm-1.0.0 because its extensions are not built. Try: gem pristine sdbm --version 1.0.0
  ].
  <0> expected but was
  <291>.
  <false> is not true.
/<<PKGBUILDDIR>>/test/test_examples.rb:120:in `rescue in assert_sample_file_has_no_output'
/<<PKGBUILDDIR>>/test/test_examples.rb:114:in `assert_sample_file_has_no_output'
/<<PKGBUILDDIR>>/test/test_examples.rb:92:in `block in make_sample_test_method'
===============================================================================
: (0.145186)
  test_sample04:					F
===============================================================================
Failure: test_sample04(GraphVizTest):
  got exception on sample04.rb: expecting empty errorput got [Ignoring debug-1.4.0 because its extensions are not built. Try: gem pristine debug --version 1.4.0
  Ignoring rbs-2.1.0 because its extensions are not built. Try: gem pristine rbs --version 2.1.0
  Ignoring sdbm-1.0.0 because its extensions are not built. Try: gem pristine sdbm --version 1.0.0
  ].
  <0> expected but was
  <291>.
  <false> is not true.
/<<PKGBUILDDIR>>/test/test_examples.rb:120:in `rescue in assert_sample_file_has_no_output'
/<<PKGBUILDDIR>>/test/test_examples.rb:114:in `assert_sample_file_has_no_output'
/<<PKGBUILDDIR>>/test/test_examples.rb:92:in `block in make_sample_test_method'
===============================================================================
: (0.128421)
  test_sample05:					F
===============================================================================
Failure: test_sample05(GraphVizTest):
  got exception on sample05.rb: expecting empty errorput got [Ignoring debug-1.4.0 because its extensions are not built. Try: gem pristine debug --version 1.4.0
  Ignoring rbs-2.1.0 because its extensions are not built. Try: gem pristine rbs --version 2.1.0
  Ignoring sdbm-1.0.0 because its extensions are not built. Try: gem pristine sdbm --version 1.0.0
  ].
  <0> expected but was
  <291>.
  <false> is not true.
/<<PKGBUILDDIR>>/test/test_examples.rb:120:in `rescue in assert_sample_file_has_no_output'
/<<PKGBUILDDIR>>/test/test_examples.rb:114:in `assert_sample_file_has_no_output'
/<<PKGBUILDDIR>>/test/test_examples.rb:92:in `block in make_sample_test_method'
===============================================================================
: (0.136009)
  test_sample06:					F
===============================================================================
Failure: test_sample06(GraphVizTest):
  got exception on sample06.rb: expecting empty errorput got [Ignoring debug-1.4.0 because its extensions are not built. Try: gem pristine debug --version 1.4.0
  Ignoring rbs-2.1.0 because its extensions are not built. Try: gem pristine rbs --version 2.1.0
  Ignoring sdbm-1.0.0 because its extensions are not built. Try: gem pristine sdbm --version 1.0.0
  ].
  <0> expected but was
  <291>.
  <false> is not true.
/<<PKGBUILDDIR>>/test/test_examples.rb:120:in `rescue in assert_sample_file_has_no_output'
/<<PKGBUILDDIR>>/test/test_examples.rb:114:in `assert_sample_file_has_no_output'
/<<PKGBUILDDIR>>/test/test_examples.rb:92:in `block in make_sample_test_method'
===============================================================================
: (0.131890)
  test_sample07:					F
===============================================================================
Failure: test_sample07(GraphVizTest)
/<<PKGBUILDDIR>>/test/test_examples.rb:110:in `assert_output_pattern'
/<<PKGBUILDDIR>>/test/test_examples.rb:25:in `test_sample07'
     22:   }
     23: 
     24:   def test_sample07
  => 25:     assert_output_pattern(/\Adigraph structs \{.+\}\n\Z/m, '07')
     26:   end
     27: 
     28:   def test_sample22
no errors
<""> expected but was
<"Ignoring debug-1.4.0 because its extensions are not built. Try: gem pristine debug --version 1.4.0\n" +
"Ignoring rbs-2.1.0 because its extensions are not built. Try: gem pristine rbs --version 2.1.0\n" +
"Ignoring sdbm-1.0.0 because its extensions are not built. Try: gem pristine sdbm --version 1.0.0\n">
===============================================================================
: (0.134331)
  test_sample08:					F
===============================================================================
Failure: test_sample08(GraphVizTest):
  got exception on sample08.rb: expecting empty errorput got [Ignoring debug-1.4.0 because its extensions are not built. Try: gem pristine debug --version 1.4.0
  Ignoring rbs-2.1.0 because its extensions are not built. Try: gem pristine rbs --version 2.1.0
  Ignoring sdbm-1.0.0 because its extensions are not built. Try: gem pristine sdbm --version 1.0.0
  ].
  <0> expected but was
  <291>.
  <false> is not true.
/<<PKGBUILDDIR>>/test/test_examples.rb:120:in `rescue in assert_sample_file_has_no_output'
/<<PKGBUILDDIR>>/test/test_examples.rb:114:in `assert_sample_file_has_no_output'
/<<PKGBUILDDIR>>/test/test_examples.rb:92:in `block in make_sample_test_method'
===============================================================================
: (0.130881)
  test_sample09:					F
===============================================================================
Failure: test_sample09(GraphVizTest):
  got exception on sample09.rb: expecting empty errorput got [Ignoring debug-1.4.0 because its extensions are not built. Try: gem pristine debug --version 1.4.0
  Ignoring rbs-2.1.0 because its extensions are not built. Try: gem pristine rbs --version 2.1.0
  Ignoring sdbm-1.0.0 because its extensions are not built. Try: gem pristine sdbm --version 1.0.0
  ].
  <0> expected but was
  <291>.
  <false> is not true.
/<<PKGBUILDDIR>>/test/test_examples.rb:120:in `rescue in assert_sample_file_has_no_output'
/<<PKGBUILDDIR>>/test/test_examples.rb:114:in `assert_sample_file_has_no_output'
/<<PKGBUILDDIR>>/test/test_examples.rb:92:in `block in make_sample_test_method'
===============================================================================
: (0.184865)
  test_sample10:					F
===============================================================================
Failure: test_sample10(GraphVizTest):
  got exception on sample10.rb: expecting empty errorput got [Ignoring debug-1.4.0 because its extensions are not built. Try: gem pristine debug --version 1.4.0
  Ignoring rbs-2.1.0 because its extensions are not built. Try: gem pristine rbs --version 2.1.0
  Ignoring sdbm-1.0.0 because its extensions are not built. Try: gem pristine sdbm --version 1.0.0
  ].
  <0> expected but was
  <291>.
  <false> is not true.
/<<PKGBUILDDIR>>/test/test_examples.rb:120:in `rescue in assert_sample_file_has_no_output'
/<<PKGBUILDDIR>>/test/test_examples.rb:114:in `assert_sample_file_has_no_output'
/<<PKGBUILDDIR>>/test/test_examples.rb:92:in `block in make_sample_test_method'
===============================================================================
: (0.142700)
  test_sample11:					F
===============================================================================
Failure: test_sample11(GraphVizTest):
  got exception on sample11.rb: expecting empty errorput got [Ignoring debug-1.4.0 because its extensions are not built. Try: gem pristine debug --version 1.4.0
  Ignoring rbs-2.1.0 because its extensions are not built. Try: gem pristine rbs --version 2.1.0
  Ignoring sdbm-1.0.0 because its extensions are not built. Try: gem pristine sdbm --version 1.0.0
  ].
  <0> expected but was
  <291>.
  <false> is not true.
/<<PKGBUILDDIR>>/test/test_examples.rb:120:in `rescue in assert_sample_file_has_no_output'
/<<PKGBUILDDIR>>/test/test_examples.rb:114:in `assert_sample_file_has_no_output'
/<<PKGBUILDDIR>>/test/test_examples.rb:92:in `block in make_sample_test_method'
===============================================================================
: (0.161829)
  test_sample12:					F
===============================================================================
Failure: test_sample12(GraphVizTest):
  got exception on sample12.rb: expecting empty errorput got [Ignoring debug-1.4.0 because its extensions are not built. Try: gem pristine debug --version 1.4.0
  Ignoring rbs-2.1.0 because its extensions are not built. Try: gem pristine rbs --version 2.1.0
  Ignoring sdbm-1.0.0 because its extensions are not built. Try: gem pristine sdbm --version 1.0.0
  ].
  <0> expected but was
  <291>.
  <false> is not true.
/<<PKGBUILDDIR>>/test/test_examples.rb:120:in `rescue in assert_sample_file_has_no_output'
/<<PKGBUILDDIR>>/test/test_examples.rb:114:in `assert_sample_file_has_no_output'
/<<PKGBUILDDIR>>/test/test_examples.rb:92:in `block in make_sample_test_method'
===============================================================================
: (0.145711)
  test_sample13:					F
===============================================================================
Failure: test_sample13(GraphVizTest):
  got exception on sample13.rb: expecting empty errorput got [Ignoring debug-1.4.0 because its extensions are not built. Try: gem pristine debug --version 1.4.0
  Ignoring rbs-2.1.0 because its extensions are not built. Try: gem pristine rbs --version 2.1.0
  Ignoring sdbm-1.0.0 because its extensions are not built. Try: gem pristine sdbm --version 1.0.0
  ].
  <0> expected but was
  <291>.
  <false> is not true.
/<<PKGBUILDDIR>>/test/test_examples.rb:120:in `rescue in assert_sample_file_has_no_output'
/<<PKGBUILDDIR>>/test/test_examples.rb:114:in `assert_sample_file_has_no_output'
/<<PKGBUILDDIR>>/test/test_examples.rb:92:in `block in make_sample_test_method'
===============================================================================
: (0.149730)
  test_sample14:					F
===============================================================================
Failure: test_sample14(GraphVizTest):
  got exception on sample14.rb: expecting empty errorput got [Ignoring debug-1.4.0 because its extensions are not built. Try: gem pristine debug --version 1.4.0
  Ignoring rbs-2.1.0 because its extensions are not built. Try: gem pristine rbs --version 2.1.0
  Ignoring sdbm-1.0.0 because its extensions are not built. Try: gem pristine sdbm --version 1.0.0
  ].
  <0> expected but was
  <291>.
  <false> is not true.
/<<PKGBUILDDIR>>/test/test_examples.rb:120:in `rescue in assert_sample_file_has_no_output'
/<<PKGBUILDDIR>>/test/test_examples.rb:114:in `assert_sample_file_has_no_output'
/<<PKGBUILDDIR>>/test/test_examples.rb:92:in `block in make_sample_test_method'
===============================================================================
: (0.155738)
  test_sample15:					F
===============================================================================
Failure: test_sample15(GraphVizTest):
  got exception on sample15.rb: expecting empty errorput got [Ignoring debug-1.4.0 because its extensions are not built. Try: gem pristine debug --version 1.4.0
  Ignoring rbs-2.1.0 because its extensions are not built. Try: gem pristine rbs --version 2.1.0
  Ignoring sdbm-1.0.0 because its extensions are not built. Try: gem pristine sdbm --version 1.0.0
  ].
  <0> expected but was
  <291>.
  <false> is not true.
/<<PKGBUILDDIR>>/test/test_examples.rb:120:in `rescue in assert_sample_file_has_no_output'
/<<PKGBUILDDIR>>/test/test_examples.rb:114:in `assert_sample_file_has_no_output'
/<<PKGBUILDDIR>>/test/test_examples.rb:92:in `block in make_sample_test_method'
===============================================================================
: (0.141850)
  test_sample16:					F
===============================================================================
Failure: test_sample16(GraphVizTest):
  got exception on sample16.rb: expecting empty errorput got [Ignoring debug-1.4.0 because its extensions are not built. Try: gem pristine debug --version 1.4.0
  Ignoring rbs-2.1.0 because its extensions are not built. Try: gem pristine rbs --version 2.1.0
  Ignoring sdbm-1.0.0 because its extensions are not built. Try: gem pristine sdbm --version 1.0.0
  ].
  <0> expected but was
  <291>.
  <false> is not true.
/<<PKGBUILDDIR>>/test/test_examples.rb:120:in `rescue in assert_sample_file_has_no_output'
/<<PKGBUILDDIR>>/test/test_examples.rb:114:in `assert_sample_file_has_no_output'
/<<PKGBUILDDIR>>/test/test_examples.rb:92:in `block in make_sample_test_method'
===============================================================================
: (0.129129)
  test_sample17:					F
===============================================================================
Failure: test_sample17(GraphVizTest):
  got exception on sample17.rb: expecting empty errorput got [Ignoring debug-1.4.0 because its extensions are not built. Try: gem pristine debug --version 1.4.0
  Ignoring rbs-2.1.0 because its extensions are not built. Try: gem pristine rbs --version 2.1.0
  Ignoring sdbm-1.0.0 because its extensions are not built. Try: gem pristine sdbm --version 1.0.0
  ].
  <0> expected but was
  <291>.
  <false> is not true.
/<<PKGBUILDDIR>>/test/test_examples.rb:120:in `rescue in assert_sample_file_has_no_output'
/<<PKGBUILDDIR>>/test/test_examples.rb:114:in `assert_sample_file_has_no_output'
/<<PKGBUILDDIR>>/test/test_examples.rb:92:in `block in make_sample_test_method'
===============================================================================
: (0.183221)
  test_sample18:					F
===============================================================================
Failure: test_sample18(GraphVizTest):
  got exception on sample18.rb: expecting empty errorput got [Ignoring debug-1.4.0 because its extensions are not built. Try: gem pristine debug --version 1.4.0
  Ignoring rbs-2.1.0 because its extensions are not built. Try: gem pristine rbs --version 2.1.0
  Ignoring sdbm-1.0.0 because its extensions are not built. Try: gem pristine sdbm --version 1.0.0
  ].
  <0> expected but was
  <291>.
  <false> is not true.
/<<PKGBUILDDIR>>/test/test_examples.rb:120:in `rescue in assert_sample_file_has_no_output'
/<<PKGBUILDDIR>>/test/test_examples.rb:114:in `assert_sample_file_has_no_output'
/<<PKGBUILDDIR>>/test/test_examples.rb:92:in `block in make_sample_test_method'
===============================================================================
: (0.173254)
  test_sample19:					F
===============================================================================
Failure: test_sample19(GraphVizTest):
  got exception on sample19.rb: expecting empty errorput got [Ignoring debug-1.4.0 because its extensions are not built. Try: gem pristine debug --version 1.4.0
  Ignoring rbs-2.1.0 because its extensions are not built. Try: gem pristine rbs --version 2.1.0
  Ignoring sdbm-1.0.0 because its extensions are not built. Try: gem pristine sdbm --version 1.0.0
  ].
  <0> expected but was
  <291>.
  <false> is not true.
/<<PKGBUILDDIR>>/test/test_examples.rb:120:in `rescue in assert_sample_file_has_no_output'
/<<PKGBUILDDIR>>/test/test_examples.rb:114:in `assert_sample_file_has_no_output'
/<<PKGBUILDDIR>>/test/test_examples.rb:92:in `block in make_sample_test_method'
===============================================================================
: (0.139439)
  test_sample20:					F
===============================================================================
Failure: test_sample20(GraphVizTest):
  got exception on sample20.rb: expecting empty errorput got [Ignoring debug-1.4.0 because its extensions are not built. Try: gem pristine debug --version 1.4.0
  Ignoring rbs-2.1.0 because its extensions are not built. Try: gem pristine rbs --version 2.1.0
  Ignoring sdbm-1.0.0 because its extensions are not built. Try: gem pristine sdbm --version 1.0.0
  ].
  <0> expected but was
  <291>.
  <false> is not true.
/<<PKGBUILDDIR>>/test/test_examples.rb:120:in `rescue in assert_sample_file_has_no_output'
/<<PKGBUILDDIR>>/test/test_examples.rb:114:in `assert_sample_file_has_no_output'
/<<PKGBUILDDIR>>/test/test_examples.rb:92:in `block in make_sample_test_method'
===============================================================================
: (0.179519)
  test_sample21:					F
===============================================================================
Failure: test_sample21(GraphVizTest):
  got exception on sample21.rb: expecting empty errorput got [Ignoring debug-1.4.0 because its extensions are not built. Try: gem pristine debug --version 1.4.0
  Ignoring rbs-2.1.0 because its extensions are not built. Try: gem pristine rbs --version 2.1.0
  Ignoring sdbm-1.0.0 because its extensions are not built. Try: gem pristine sdbm --version 1.0.0
  ].
  <0> expected but was
  <291>.
  <false> is not true.
/<<PKGBUILDDIR>>/test/test_examples.rb:120:in `rescue in assert_sample_file_has_no_output'
/<<PKGBUILDDIR>>/test/test_examples.rb:114:in `assert_sample_file_has_no_output'
/<<PKGBUILDDIR>>/test/test_examples.rb:92:in `block in make_sample_test_method'
===============================================================================
: (0.142812)
  test_sample22:					F
===============================================================================
Failure: test_sample22(GraphVizTest)
/<<PKGBUILDDIR>>/test/test_examples.rb:110:in `assert_output_pattern'
/<<PKGBUILDDIR>>/test/test_examples.rb:29:in `test_sample22'
     26:   end
     27: 
     28:   def test_sample22
  => 29:     assert_output_pattern(/\Adigraph mainmap \{.+\}\n\Z/m, '22')
     30:   end
     31: 
     32:   def test_sample23
no errors
<""> expected but was
<"Ignoring debug-1.4.0 because its extensions are not built. Try: gem pristine debug --version 1.4.0\n" +
"Ignoring rbs-2.1.0 because its extensions are not built. Try: gem pristine rbs --version 2.1.0\n" +
"Ignoring sdbm-1.0.0 because its extensions are not built. Try: gem pristine sdbm --version 1.0.0\n">
===============================================================================
: (0.129046)
  test_sample23:					F
===============================================================================
Failure: test_sample23(GraphVizTest)
/<<PKGBUILDDIR>>/test/test_examples.rb:110:in `assert_output_pattern'
/<<PKGBUILDDIR>>/test/test_examples.rb:33:in `test_sample23'
     30:   end
     31: 
     32:   def test_sample23
  => 33:     assert_output_pattern(%r{\A<map.+</map>\n\Z}m, '23')
     34:   end
     35: 
     36:   def test_sample27
no errors
<""> expected but was
<"Ignoring debug-1.4.0 because its extensions are not built. Try: gem pristine debug --version 1.4.0\n" +
"Ignoring rbs-2.1.0 because its extensions are not built. Try: gem pristine rbs --version 2.1.0\n" +
"Ignoring sdbm-1.0.0 because its extensions are not built. Try: gem pristine sdbm --version 1.0.0\n">
===============================================================================
: (0.124717)
  test_sample24:					F
===============================================================================
Failure: test_sample24(GraphVizTest):
  got exception on sample24.rb: expecting empty errorput got [Ignoring debug-1.4.0 because its extensions are not built. Try: gem pristine debug --version 1.4.0
  Ignoring rbs-2.1.0 because its extensions are not built. Try: gem pristine rbs --version 2.1.0
  Ignoring sdbm-1.0.0 because its extensions are not built. Try: gem pristine sdbm --version 1.0.0
  ].
  <0> expected but was
  <291>.
  <false> is not true.
/<<PKGBUILDDIR>>/test/test_examples.rb:120:in `rescue in assert_sample_file_has_no_output'
/<<PKGBUILDDIR>>/test/test_examples.rb:114:in `assert_sample_file_has_no_output'
/<<PKGBUILDDIR>>/test/test_examples.rb:92:in `block in make_sample_test_method'
===============================================================================
: (0.132776)
  test_sample25:					F
===============================================================================
Failure: test_sample25(GraphVizTest):
  got exception on sample25.rb: expecting empty errorput got [Ignoring debug-1.4.0 because its extensions are not built. Try: gem pristine debug --version 1.4.0
  Ignoring rbs-2.1.0 because its extensions are not built. Try: gem pristine rbs --version 2.1.0
  Ignoring sdbm-1.0.0 because its extensions are not built. Try: gem pristine sdbm --version 1.0.0
  ].
  <0> expected but was
  <291>.
  <false> is not true.
/<<PKGBUILDDIR>>/test/test_examples.rb:120:in `rescue in assert_sample_file_has_no_output'
/<<PKGBUILDDIR>>/test/test_examples.rb:114:in `assert_sample_file_has_no_output'
/<<PKGBUILDDIR>>/test/test_examples.rb:92:in `block in make_sample_test_method'
===============================================================================
: (0.131238)
  test_sample26:					F
===============================================================================
Failure: test_sample26(GraphVizTest):
  got exception on sample26.rb: expecting empty errorput got [Ignoring debug-1.4.0 because its extensions are not built. Try: gem pristine debug --version 1.4.0
  Ignoring rbs-2.1.0 because its extensions are not built. Try: gem pristine rbs --version 2.1.0
  Ignoring sdbm-1.0.0 because its extensions are not built. Try: gem pristine sdbm --version 1.0.0
  ].
  <0> expected but was
  <291>.
  <false> is not true.
/<<PKGBUILDDIR>>/test/test_examples.rb:120:in `rescue in assert_sample_file_has_no_output'
/<<PKGBUILDDIR>>/test/test_examples.rb:114:in `assert_sample_file_has_no_output'
/<<PKGBUILDDIR>>/test/test_examples.rb:92:in `block in make_sample_test_method'
===============================================================================
: (0.138245)
  test_sample27:					F
===============================================================================
Failure: test_sample27(GraphVizTest)
/<<PKGBUILDDIR>>/test/test_examples.rb:110:in `assert_output_pattern'
/<<PKGBUILDDIR>>/test/test_examples.rb:37:in `test_sample27'
     34:   end
     35: 
     36:   def test_sample27
  => 37:     assert_output_pattern(/\Adigraph G \{.*\}\n\Z/m, '27')
     38:   end
     39: 
     40:   def test_sample38
no errors
<""> expected but was
<"Ignoring debug-1.4.0 because its extensions are not built. Try: gem pristine debug --version 1.4.0\n" +
"Ignoring rbs-2.1.0 because its extensions are not built. Try: gem pristine rbs --version 2.1.0\n">
===============================================================================
: (0.110468)
  test_sample28:					F
===============================================================================
Failure: test_sample28(GraphVizTest):
  got exception on sample28.rb: expecting empty errorput got [Ignoring debug-1.4.0 because its extensions are not built. Try: gem pristine debug --version 1.4.0
  Ignoring rbs-2.1.0 because its extensions are not built. Try: gem pristine rbs --version 2.1.0
  Ignoring sdbm-1.0.0 because its extensions are not built. Try: gem pristine sdbm --version 1.0.0
  ].
  <0> expected but was
  <291>.
  <false> is not true.
/<<PKGBUILDDIR>>/test/test_examples.rb:120:in `rescue in assert_sample_file_has_no_output'
/<<PKGBUILDDIR>>/test/test_examples.rb:114:in `assert_sample_file_has_no_output'
/<<PKGBUILDDIR>>/test/test_examples.rb:92:in `block in make_sample_test_method'
===============================================================================
: (0.129024)
  test_sample29:					F
===============================================================================
Failure: test_sample29(GraphVizTest):
  got exception on sample29.rb: expecting empty errorput got [Ignoring debug-1.4.0 because its extensions are not built. Try: gem pristine debug --version 1.4.0
  Ignoring rbs-2.1.0 because its extensions are not built. Try: gem pristine rbs --version 2.1.0
  Ignoring sdbm-1.0.0 because its extensions are not built. Try: gem pristine sdbm --version 1.0.0
  ].
  <0> expected but was
  <291>.
  <false> is not true.
/<<PKGBUILDDIR>>/test/test_examples.rb:120:in `rescue in assert_sample_file_has_no_output'
/<<PKGBUILDDIR>>/test/test_examples.rb:114:in `assert_sample_file_has_no_output'
/<<PKGBUILDDIR>>/test/test_examples.rb:92:in `block in make_sample_test_method'
===============================================================================
: (0.124211)
  test_sample30:					F
===============================================================================
Failure: test_sample30(GraphVizTest):
  got exception on sample30.rb: expecting empty errorput got [Ignoring debug-1.4.0 because its extensions are not built. Try: gem pristine debug --version 1.4.0
  Ignoring rbs-2.1.0 because its extensions are not built. Try: gem pristine rbs --version 2.1.0
  Ignoring sdbm-1.0.0 because its extensions are not built. Try: gem pristine sdbm --version 1.0.0
  ].
  <0> expected but was
  <291>.
  <false> is not true.
/<<PKGBUILDDIR>>/test/test_examples.rb:120:in `rescue in assert_sample_file_has_no_output'
/<<PKGBUILDDIR>>/test/test_examples.rb:114:in `assert_sample_file_has_no_output'
/<<PKGBUILDDIR>>/test/test_examples.rb:92:in `block in make_sample_test_method'
===============================================================================
: (0.126454)
  test_sample31:					F
===============================================================================
Failure: test_sample31(GraphVizTest):
  got exception on sample31.rb: expecting empty errorput got [Ignoring debug-1.4.0 because its extensions are not built. Try: gem pristine debug --version 1.4.0
  Ignoring rbs-2.1.0 because its extensions are not built. Try: gem pristine rbs --version 2.1.0
  Ignoring sdbm-1.0.0 because its extensions are not built. Try: gem pristine sdbm --version 1.0.0
  ].
  <0> expected but was
  <291>.
  <false> is not true.
/<<PKGBUILDDIR>>/test/test_examples.rb:120:in `rescue in assert_sample_file_has_no_output'
/<<PKGBUILDDIR>>/test/test_examples.rb:114:in `assert_sample_file_has_no_output'
/<<PKGBUILDDIR>>/test/test_examples.rb:92:in `block in make_sample_test_method'
===============================================================================
: (0.126153)
  test_sample32:					F
===============================================================================
Failure: test_sample32(GraphVizTest):
  got exception on sample32.rb: expecting empty errorput got [Ignoring debug-1.4.0 because its extensions are not built. Try: gem pristine debug --version 1.4.0
  Ignoring rbs-2.1.0 because its extensions are not built. Try: gem pristine rbs --version 2.1.0
  Ignoring sdbm-1.0.0 because its extensions are not built. Try: gem pristine sdbm --version 1.0.0
  ].
  <0> expected but was
  <291>.
  <false> is not true.
/<<PKGBUILDDIR>>/test/test_examples.rb:120:in `rescue in assert_sample_file_has_no_output'
/<<PKGBUILDDIR>>/test/test_examples.rb:114:in `assert_sample_file_has_no_output'
/<<PKGBUILDDIR>>/test/test_examples.rb:92:in `block in make_sample_test_method'
===============================================================================
: (0.154545)
  test_sample34:					F
===============================================================================
Failure: test_sample34(GraphVizTest):
  got exception on sample34.rb: expecting empty errorput got [Ignoring debug-1.4.0 because its extensions are not built. Try: gem pristine debug --version 1.4.0
  Ignoring rbs-2.1.0 because its extensions are not built. Try: gem pristine rbs --version 2.1.0
  Ignoring sdbm-1.0.0 because its extensions are not built. Try: gem pristine sdbm --version 1.0.0
  ].
  <0> expected but was
  <291>.
  <false> is not true.
/<<PKGBUILDDIR>>/test/test_examples.rb:120:in `rescue in assert_sample_file_has_no_output'
/<<PKGBUILDDIR>>/test/test_examples.rb:114:in `assert_sample_file_has_no_output'
/<<PKGBUILDDIR>>/test/test_examples.rb:92:in `block in make_sample_test_method'
===============================================================================
: (0.130093)
  test_sample35:					F
===============================================================================
Failure: test_sample35(GraphVizTest):
  got exception on sample35.rb: expecting empty errorput got [Ignoring debug-1.4.0 because its extensions are not built. Try: gem pristine debug --version 1.4.0
  Ignoring rbs-2.1.0 because its extensions are not built. Try: gem pristine rbs --version 2.1.0
  Ignoring sdbm-1.0.0 because its extensions are not built. Try: gem pristine sdbm --version 1.0.0
  ].
  <0> expected but was
  <291>.
  <false> is not true.
/<<PKGBUILDDIR>>/test/test_examples.rb:120:in `rescue in assert_sample_file_has_no_output'
/<<PKGBUILDDIR>>/test/test_examples.rb:114:in `assert_sample_file_has_no_output'
/<<PKGBUILDDIR>>/test/test_examples.rb:92:in `block in make_sample_test_method'
===============================================================================
: (0.148856)
  test_sample37:					F
===============================================================================
Failure: test_sample37(GraphVizTest):
  got exception on sample37.rb: expecting empty errorput got [Ignoring debug-1.4.0 because its extensions are not built. Try: gem pristine debug --version 1.4.0
  Ignoring rbs-2.1.0 because its extensions are not built. Try: gem pristine rbs --version 2.1.0
  Ignoring sdbm-1.0.0 because its extensions are not built. Try: gem pristine sdbm --version 1.0.0
  ].
  <0> expected but was
  <291>.
  <false> is not true.
/<<PKGBUILDDIR>>/test/test_examples.rb:120:in `rescue in assert_sample_file_has_no_output'
/<<PKGBUILDDIR>>/test/test_examples.rb:114:in `assert_sample_file_has_no_output'
/<<PKGBUILDDIR>>/test/test_examples.rb:92:in `block in make_sample_test_method'
===============================================================================
: (0.146207)
  test_sample38:					F
===============================================================================
Failure: test_sample38(GraphVizTest)
/<<PKGBUILDDIR>>/test/test_examples.rb:110:in `assert_output_pattern'
/<<PKGBUILDDIR>>/test/test_examples.rb:41:in `test_sample38'
     38:   end
     39: 
     40:   def test_sample38
  => 41:     assert_output_pattern(/\Adigraph G \{.*\}\n\Z/m, '38')
     42:   end
     43: 
     44:   def test_sample40
no errors
<""> expected but was
<"Ignoring debug-1.4.0 because its extensions are not built. Try: gem pristine debug --version 1.4.0\n" +
"Ignoring rbs-2.1.0 because its extensions are not built. Try: gem pristine rbs --version 2.1.0\n" +
"Ignoring sdbm-1.0.0 because its extensions are not built. Try: gem pristine sdbm --version 1.0.0\n">
===============================================================================
: (0.125180)
  test_sample39:					F
===============================================================================
Failure: test_sample39(GraphVizTest):
  got exception on sample39.rb: expecting empty errorput got [Ignoring debug-1.4.0 because its extensions are not built. Try: gem pristine debug --version 1.4.0
  Ignoring rbs-2.1.0 because its extensions are not built. Try: gem pristine rbs --version 2.1.0
  Ignoring sdbm-1.0.0 because its extensions are not built. Try: gem pristine sdbm --version 1.0.0
  ].
  <0> expected but was
  <291>.
  <false> is not true.
/<<PKGBUILDDIR>>/test/test_examples.rb:120:in `rescue in assert_sample_file_has_no_output'
/<<PKGBUILDDIR>>/test/test_examples.rb:114:in `assert_sample_file_has_no_output'
/<<PKGBUILDDIR>>/test/test_examples.rb:92:in `block in make_sample_test_method'
===============================================================================
: (0.127636)
  test_sample40:					F
===============================================================================
Failure: test_sample40(GraphVizTest)
/<<PKGBUILDDIR>>/test/test_examples.rb:110:in `assert_output_pattern'
/<<PKGBUILDDIR>>/test/test_examples.rb:45:in `test_sample40'
     42:   end
     43: 
     44:   def test_sample40
  => 45:     assert_output_pattern(/\Adigraph G \{.*\}\n\Z/m, '40')
     46:   end
     47: 
     48:   def test_sample41
no errors
<""> expected but was
<"Ignoring debug-1.4.0 because its extensions are not built. Try: gem pristine debug --version 1.4.0\n" +
"Ignoring rbs-2.1.0 because its extensions are not built. Try: gem pristine rbs --version 2.1.0\n" +
"Ignoring sdbm-1.0.0 because its extensions are not built. Try: gem pristine sdbm --version 1.0.0\n">
===============================================================================
: (0.124970)
  test_sample41:					F
===============================================================================
Failure: test_sample41(GraphVizTest)
/<<PKGBUILDDIR>>/test/test_examples.rb:110:in `assert_output_pattern'
/<<PKGBUILDDIR>>/test/test_examples.rb:49:in `test_sample41'
     46:   end
     47: 
     48:   def test_sample41
  => 49:     assert_output_pattern(/\A.*\Z/m, '40')
     50:   end
     51: 
     52:   def test_sample55
no errors
<""> expected but was
<"Ignoring debug-1.4.0 because its extensions are not built. Try: gem pristine debug --version 1.4.0\n" +
"Ignoring rbs-2.1.0 because its extensions are not built. Try: gem pristine rbs --version 2.1.0\n" +
"Ignoring sdbm-1.0.0 because its extensions are not built. Try: gem pristine sdbm --version 1.0.0\n">
===============================================================================
: (0.127167)
  test_sample42:					F
===============================================================================
Failure: test_sample42(GraphVizTest):
  got exception on sample42.rb: expecting empty errorput got [Ignoring debug-1.4.0 because its extensions are not built. Try: gem pristine debug --version 1.4.0
  Ignoring rbs-2.1.0 because its extensions are not built. Try: gem pristine rbs --version 2.1.0
  Ignoring sdbm-1.0.0 because its extensions are not built. Try: gem pristine sdbm --version 1.0.0
  ].
  <0> expected but was
  <291>.
  <false> is not true.
/<<PKGBUILDDIR>>/test/test_examples.rb:120:in `rescue in assert_sample_file_has_no_output'
/<<PKGBUILDDIR>>/test/test_examples.rb:114:in `assert_sample_file_has_no_output'
/<<PKGBUILDDIR>>/test/test_examples.rb:92:in `block in make_sample_test_method'
===============================================================================
: (0.137111)
  test_sample43:					F
===============================================================================
Failure: test_sample43(GraphVizTest):
  got exception on sample43.rb: expecting empty errorput got [Ignoring debug-1.4.0 because its extensions are not built. Try: gem pristine debug --version 1.4.0
  Ignoring rbs-2.1.0 because its extensions are not built. Try: gem pristine rbs --version 2.1.0
  Ignoring sdbm-1.0.0 because its extensions are not built. Try: gem pristine sdbm --version 1.0.0
  ].
  <0> expected but was
  <291>.
  <false> is not true.
/<<PKGBUILDDIR>>/test/test_examples.rb:120:in `rescue in assert_sample_file_has_no_output'
/<<PKGBUILDDIR>>/test/test_examples.rb:114:in `assert_sample_file_has_no_output'
/<<PKGBUILDDIR>>/test/test_examples.rb:92:in `block in make_sample_test_method'
===============================================================================
: (0.132027)
  test_sample44:					F
===============================================================================
Failure: test_sample44(GraphVizTest):
  got exception on sample44.rb: expecting empty errorput got [Ignoring debug-1.4.0 because its extensions are not built. Try: gem pristine debug --version 1.4.0
  Ignoring rbs-2.1.0 because its extensions are not built. Try: gem pristine rbs --version 2.1.0
  Ignoring sdbm-1.0.0 because its extensions are not built. Try: gem pristine sdbm --version 1.0.0
  ].
  <0> expected but was
  <291>.
  <false> is not true.
/<<PKGBUILDDIR>>/test/test_examples.rb:120:in `rescue in assert_sample_file_has_no_output'
/<<PKGBUILDDIR>>/test/test_examples.rb:114:in `assert_sample_file_has_no_output'
/<<PKGBUILDDIR>>/test/test_examples.rb:92:in `block in make_sample_test_method'
===============================================================================
: (0.280429)
  test_sample45:					F
===============================================================================
Failure: test_sample45(GraphVizTest):
  got exception on sample45.rb: expecting empty errorput got [Ignoring debug-1.4.0 because its extensions are not built. Try: gem pristine debug --version 1.4.0
  Ignoring rbs-2.1.0 because its extensions are not built. Try: gem pristine rbs --version 2.1.0
  Ignoring sdbm-1.0.0 because its extensions are not built. Try: gem pristine sdbm --version 1.0.0
  ].
  <0> expected but was
  <291>.
  <false> is not true.
/<<PKGBUILDDIR>>/test/test_examples.rb:120:in `rescue in assert_sample_file_has_no_output'
/<<PKGBUILDDIR>>/test/test_examples.rb:114:in `assert_sample_file_has_no_output'
/<<PKGBUILDDIR>>/test/test_examples.rb:92:in `block in make_sample_test_method'
===============================================================================
: (0.198553)
  test_sample46:					F
===============================================================================
Failure: test_sample46(GraphVizTest):
  got exception on sample46.rb: expecting empty errorput got [Ignoring debug-1.4.0 because its extensions are not built. Try: gem pristine debug --version 1.4.0
  Ignoring rbs-2.1.0 because its extensions are not built. Try: gem pristine rbs --version 2.1.0
  Ignoring sdbm-1.0.0 because its extensions are not built. Try: gem pristine sdbm --version 1.0.0
  ].
  <0> expected but was
  <291>.
  <false> is not true.
/<<PKGBUILDDIR>>/test/test_examples.rb:120:in `rescue in assert_sample_file_has_no_output'
/<<PKGBUILDDIR>>/test/test_examples.rb:114:in `assert_sample_file_has_no_output'
/<<PKGBUILDDIR>>/test/test_examples.rb:92:in `block in make_sample_test_method'
===============================================================================
: (0.146681)
  test_sample47:					F
===============================================================================
Failure: test_sample47(GraphVizTest):
  got exception on sample47.rb: expecting empty errorput got [Ignoring debug-1.4.0 because its extensions are not built. Try: gem pristine debug --version 1.4.0
  Ignoring rbs-2.1.0 because its extensions are not built. Try: gem pristine rbs --version 2.1.0
  Ignoring sdbm-1.0.0 because its extensions are not built. Try: gem pristine sdbm --version 1.0.0
  ].
  <0> expected but was
  <291>.
  <false> is not true.
/<<PKGBUILDDIR>>/test/test_examples.rb:120:in `rescue in assert_sample_file_has_no_output'
/<<PKGBUILDDIR>>/test/test_examples.rb:114:in `assert_sample_file_has_no_output'
/<<PKGBUILDDIR>>/test/test_examples.rb:92:in `block in make_sample_test_method'
===============================================================================
: (0.249302)
  test_sample48:					F
===============================================================================
Failure: test_sample48(GraphVizTest):
  got exception on sample48.rb: expecting empty errorput got [Ignoring debug-1.4.0 because its extensions are not built. Try: gem pristine debug --version 1.4.0
  Ignoring rbs-2.1.0 because its extensions are not built. Try: gem pristine rbs --version 2.1.0
  Ignoring sdbm-1.0.0 because its extensions are not built. Try: gem pristine sdbm --version 1.0.0
  ].
  <0> expected but was
  <291>.
  <false> is not true.
/<<PKGBUILDDIR>>/test/test_examples.rb:120:in `rescue in assert_sample_file_has_no_output'
/<<PKGBUILDDIR>>/test/test_examples.rb:114:in `assert_sample_file_has_no_output'
/<<PKGBUILDDIR>>/test/test_examples.rb:92:in `block in make_sample_test_method'
===============================================================================
: (0.169141)
  test_sample49:					F
===============================================================================
Failure: test_sample49(GraphVizTest):
  got exception on sample49.rb: expecting empty errorput got [Ignoring debug-1.4.0 because its extensions are not built. Try: gem pristine debug --version 1.4.0
  Ignoring rbs-2.1.0 because its extensions are not built. Try: gem pristine rbs --version 2.1.0
  Ignoring sdbm-1.0.0 because its extensions are not built. Try: gem pristine sdbm --version 1.0.0
  ].
  <0> expected but was
  <291>.
  <false> is not true.
/<<PKGBUILDDIR>>/test/test_examples.rb:120:in `rescue in assert_sample_file_has_no_output'
/<<PKGBUILDDIR>>/test/test_examples.rb:114:in `assert_sample_file_has_no_output'
/<<PKGBUILDDIR>>/test/test_examples.rb:92:in `block in make_sample_test_method'
===============================================================================
: (0.127827)
  test_sample50:					F
===============================================================================
Failure: test_sample50(GraphVizTest):
  got exception on sample50.rb: expecting empty errorput got [Ignoring debug-1.4.0 because its extensions are not built. Try: gem pristine debug --version 1.4.0
  Ignoring rbs-2.1.0 because its extensions are not built. Try: gem pristine rbs --version 2.1.0
  Ignoring sdbm-1.0.0 because its extensions are not built. Try: gem pristine sdbm --version 1.0.0
  ].
  <0> expected but was
  <291>.
  <false> is not true.
/<<PKGBUILDDIR>>/test/test_examples.rb:120:in `rescue in assert_sample_file_has_no_output'
/<<PKGBUILDDIR>>/test/test_examples.rb:114:in `assert_sample_file_has_no_output'
/<<PKGBUILDDIR>>/test/test_examples.rb:92:in `block in make_sample_test_method'
===============================================================================
: (0.200508)
  test_sample51:					F
===============================================================================
Failure: test_sample51(GraphVizTest):
  got exception on sample51.rb: expecting empty errorput got [Ignoring debug-1.4.0 because its extensions are not built. Try: gem pristine debug --version 1.4.0
  Ignoring rbs-2.1.0 because its extensions are not built. Try: gem pristine rbs --version 2.1.0
  Ignoring sdbm-1.0.0 because its extensions are not built. Try: gem pristine sdbm --version 1.0.0
  ].
  <0> expected but was
  <291>.
  <false> is not true.
/<<PKGBUILDDIR>>/test/test_examples.rb:120:in `rescue in assert_sample_file_has_no_output'
/<<PKGBUILDDIR>>/test/test_examples.rb:114:in `assert_sample_file_has_no_output'
/<<PKGBUILDDIR>>/test/test_examples.rb:92:in `block in make_sample_test_method'
===============================================================================
: (0.141051)
  test_sample52:					F
===============================================================================
Failure: test_sample52(GraphVizTest):
  got exception on sample52.rb: expecting empty errorput got [Ignoring debug-1.4.0 because its extensions are not built. Try: gem pristine debug --version 1.4.0
  Ignoring rbs-2.1.0 because its extensions are not built. Try: gem pristine rbs --version 2.1.0
  Ignoring sdbm-1.0.0 because its extensions are not built. Try: gem pristine sdbm --version 1.0.0
  ].
  <0> expected but was
  <291>.
  <false> is not true.
/<<PKGBUILDDIR>>/test/test_examples.rb:120:in `rescue in assert_sample_file_has_no_output'
/<<PKGBUILDDIR>>/test/test_examples.rb:114:in `assert_sample_file_has_no_output'
/<<PKGBUILDDIR>>/test/test_examples.rb:92:in `block in make_sample_test_method'
===============================================================================
: (0.173953)
  test_sample54:					F
===============================================================================
Failure: test_sample54(GraphVizTest):
  got exception on sample54.rb: expecting empty errorput got [Ignoring debug-1.4.0 because its extensions are not built. Try: gem pristine debug --version 1.4.0
  Ignoring rbs-2.1.0 because its extensions are not built. Try: gem pristine rbs --version 2.1.0
  Ignoring sdbm-1.0.0 because its extensions are not built. Try: gem pristine sdbm --version 1.0.0
  ].
  <0> expected but was
  <291>.
  <false> is not true.
/<<PKGBUILDDIR>>/test/test_examples.rb:120:in `rescue in assert_sample_file_has_no_output'
/<<PKGBUILDDIR>>/test/test_examples.rb:114:in `assert_sample_file_has_no_output'
/<<PKGBUILDDIR>>/test/test_examples.rb:92:in `block in make_sample_test_method'
===============================================================================
: (0.144818)
  test_sample55:					F
===============================================================================
Failure: test_sample55(GraphVizTest)
/<<PKGBUILDDIR>>/test/test_examples.rb:110:in `assert_output_pattern'
/<<PKGBUILDDIR>>/test/test_examples.rb:53:in `test_sample55'
     50:   end
     51: 
     52:   def test_sample55
  => 53:     assert_output_pattern(/\Agraph G \{.*\}\n\Z/m, '55')
     54:   end
     55: 
     56:   def test_sample62
no errors
<""> expected but was
<"Ignoring debug-1.4.0 because its extensions are not built. Try: gem pristine debug --version 1.4.0\n" +
"Ignoring rbs-2.1.0 because its extensions are not built. Try: gem pristine rbs --version 2.1.0\n" +
"Ignoring sdbm-1.0.0 because its extensions are not built. Try: gem pristine sdbm --version 1.0.0\n">
===============================================================================
: (0.177602)
  test_sample56:					F
===============================================================================
Failure: test_sample56(GraphVizTest):
  got exception on sample56.rb: expecting empty errorput got [Ignoring debug-1.4.0 because its extensions are not built. Try: gem pristine debug --version 1.4.0
  Ignoring rbs-2.1.0 because its extensions are not built. Try: gem pristine rbs --version 2.1.0
  Ignoring sdbm-1.0.0 because its extensions are not built. Try: gem pristine sdbm --version 1.0.0
  ].
  <0> expected but was
  <291>.
  <false> is not true.
/<<PKGBUILDDIR>>/test/test_examples.rb:120:in `rescue in assert_sample_file_has_no_output'
/<<PKGBUILDDIR>>/test/test_examples.rb:114:in `assert_sample_file_has_no_output'
/<<PKGBUILDDIR>>/test/test_examples.rb:92:in `block in make_sample_test_method'
===============================================================================
: (0.134142)
  test_sample58:					F
===============================================================================
Failure: test_sample58(GraphVizTest):
  got exception on sample58.rb: expecting empty errorput got [Ignoring debug-1.4.0 because its extensions are not built. Try: gem pristine debug --version 1.4.0
  Ignoring rbs-2.1.0 because its extensions are not built. Try: gem pristine rbs --version 2.1.0
  Ignoring sdbm-1.0.0 because its extensions are not built. Try: gem pristine sdbm --version 1.0.0
  ].
  <0> expected but was
  <291>.
  <false> is not true.
/<<PKGBUILDDIR>>/test/test_examples.rb:120:in `rescue in assert_sample_file_has_no_output'
/<<PKGBUILDDIR>>/test/test_examples.rb:114:in `assert_sample_file_has_no_output'
/<<PKGBUILDDIR>>/test/test_examples.rb:92:in `block in make_sample_test_method'
===============================================================================
: (0.239779)
  test_sample59:					F
===============================================================================
Failure: test_sample59(GraphVizTest):
  got exception on sample59.rb: expecting empty errorput got [Ignoring debug-1.4.0 because its extensions are not built. Try: gem pristine debug --version 1.4.0
  Ignoring rbs-2.1.0 because its extensions are not built. Try: gem pristine rbs --version 2.1.0
  Ignoring sdbm-1.0.0 because its extensions are not built. Try: gem pristine sdbm --version 1.0.0
  ].
  <0> expected but was
  <291>.
  <false> is not true.
/<<PKGBUILDDIR>>/test/test_examples.rb:120:in `rescue in assert_sample_file_has_no_output'
/<<PKGBUILDDIR>>/test/test_examples.rb:114:in `assert_sample_file_has_no_output'
/<<PKGBUILDDIR>>/test/test_examples.rb:92:in `block in make_sample_test_method'
===============================================================================
: (0.146924)
  test_sample60:					F
===============================================================================
Failure: test_sample60(GraphVizTest):
  got exception on sample60.rb: expecting empty errorput got [Ignoring debug-1.4.0 because its extensions are not built. Try: gem pristine debug --version 1.4.0
  Ignoring rbs-2.1.0 because its extensions are not built. Try: gem pristine rbs --version 2.1.0
  Ignoring sdbm-1.0.0 because its extensions are not built. Try: gem pristine sdbm --version 1.0.0
  ].
  <0> expected but was
  <291>.
  <false> is not true.
/<<PKGBUILDDIR>>/test/test_examples.rb:120:in `rescue in assert_sample_file_has_no_output'
/<<PKGBUILDDIR>>/test/test_examples.rb:114:in `assert_sample_file_has_no_output'
/<<PKGBUILDDIR>>/test/test_examples.rb:92:in `block in make_sample_test_method'
===============================================================================
: (0.137564)
  test_sample61:					F
===============================================================================
Failure: test_sample61(GraphVizTest):
  got exception on sample61.rb: expecting empty errorput got [Ignoring debug-1.4.0 because its extensions are not built. Try: gem pristine debug --version 1.4.0
  Ignoring rbs-2.1.0 because its extensions are not built. Try: gem pristine rbs --version 2.1.0
  Ignoring sdbm-1.0.0 because its extensions are not built. Try: gem pristine sdbm --version 1.0.0
  ].
  <0> expected but was
  <291>.
  <false> is not true.
/<<PKGBUILDDIR>>/test/test_examples.rb:120:in `rescue in assert_sample_file_has_no_output'
/<<PKGBUILDDIR>>/test/test_examples.rb:114:in `assert_sample_file_has_no_output'
/<<PKGBUILDDIR>>/test/test_examples.rb:92:in `block in make_sample_test_method'
===============================================================================
: (0.134451)
  test_sample62:					F
===============================================================================
Failure: test_sample62(GraphVizTest)
/<<PKGBUILDDIR>>/test/test_examples.rb:110:in `assert_output_pattern'
/<<PKGBUILDDIR>>/test/test_examples.rb:57:in `test_sample62'
     54:   end
     55: 
     56:   def test_sample62
  => 57:      assert_output_pattern(/\ANode.*\n\Z/m, '62')
     58:   end
     59: 
     60:   def test_sample70
no errors
<""> expected but was
<"Ignoring debug-1.4.0 because its extensions are not built. Try: gem pristine debug --version 1.4.0\n" +
"Ignoring rbs-2.1.0 because its extensions are not built. Try: gem pristine rbs --version 2.1.0\n" +
"Ignoring sdbm-1.0.0 because its extensions are not built. Try: gem pristine sdbm --version 1.0.0\n">
===============================================================================
: (0.149019)
  test_sample63:					F
===============================================================================
Failure: test_sample63(GraphVizTest):
  got exception on sample63.rb: expecting empty errorput got [Ignoring debug-1.4.0 because its extensions are not built. Try: gem pristine debug --version 1.4.0
  Ignoring rbs-2.1.0 because its extensions are not built. Try: gem pristine rbs --version 2.1.0
  Ignoring sdbm-1.0.0 because its extensions are not built. Try: gem pristine sdbm --version 1.0.0
  ].
  <0> expected but was
  <291>.
  <false> is not true.
/<<PKGBUILDDIR>>/test/test_examples.rb:120:in `rescue in assert_sample_file_has_no_output'
/<<PKGBUILDDIR>>/test/test_examples.rb:114:in `assert_sample_file_has_no_output'
/<<PKGBUILDDIR>>/test/test_examples.rb:92:in `block in make_sample_test_method'
===============================================================================
: (0.135829)
  test_sample64:					F
===============================================================================
Failure: test_sample64(GraphVizTest):
  got exception on sample64.rb: expecting empty errorput got [Ignoring debug-1.4.0 because its extensions are not built. Try: gem pristine debug --version 1.4.0
  Ignoring rbs-2.1.0 because its extensions are not built. Try: gem pristine rbs --version 2.1.0
  Ignoring sdbm-1.0.0 because its extensions are not built. Try: gem pristine sdbm --version 1.0.0
  ].
  <0> expected but was
  <291>.
  <false> is not true.
/<<PKGBUILDDIR>>/test/test_examples.rb:120:in `rescue in assert_sample_file_has_no_output'
/<<PKGBUILDDIR>>/test/test_examples.rb:114:in `assert_sample_file_has_no_output'
/<<PKGBUILDDIR>>/test/test_examples.rb:92:in `block in make_sample_test_method'
===============================================================================
: (0.146508)
  test_sample65:					F
===============================================================================
Failure: test_sample65(GraphVizTest):
  got exception on sample65.rb: expecting empty errorput got [Ignoring debug-1.4.0 because its extensions are not built. Try: gem pristine debug --version 1.4.0
  Ignoring rbs-2.1.0 because its extensions are not built. Try: gem pristine rbs --version 2.1.0
  Ignoring sdbm-1.0.0 because its extensions are not built. Try: gem pristine sdbm --version 1.0.0
  ].
  <0> expected but was
  <291>.
  <false> is not true.
/<<PKGBUILDDIR>>/test/test_examples.rb:120:in `rescue in assert_sample_file_has_no_output'
/<<PKGBUILDDIR>>/test/test_examples.rb:114:in `assert_sample_file_has_no_output'
/<<PKGBUILDDIR>>/test/test_examples.rb:92:in `block in make_sample_test_method'
===============================================================================
: (0.132764)
  test_sample66:					F
===============================================================================
Failure: test_sample66(GraphVizTest):
  got exception on sample66.rb: expecting empty errorput got [Ignoring debug-1.4.0 because its extensions are not built. Try: gem pristine debug --version 1.4.0
  Ignoring rbs-2.1.0 because its extensions are not built. Try: gem pristine rbs --version 2.1.0
  Ignoring sdbm-1.0.0 because its extensions are not built. Try: gem pristine sdbm --version 1.0.0
  ].
  <0> expected but was
  <291>.
  <false> is not true.
/<<PKGBUILDDIR>>/test/test_examples.rb:120:in `rescue in assert_sample_file_has_no_output'
/<<PKGBUILDDIR>>/test/test_examples.rb:114:in `assert_sample_file_has_no_output'
/<<PKGBUILDDIR>>/test/test_examples.rb:92:in `block in make_sample_test_method'
===============================================================================
: (0.240798)
  test_sample67:					F
===============================================================================
Failure: test_sample67(GraphVizTest):
  got exception on sample67.rb: expecting empty errorput got [Ignoring debug-1.4.0 because its extensions are not built. Try: gem pristine debug --version 1.4.0
  Ignoring rbs-2.1.0 because its extensions are not built. Try: gem pristine rbs --version 2.1.0
  Ignoring sdbm-1.0.0 because its extensions are not built. Try: gem pristine sdbm --version 1.0.0
  ].
  <0> expected but was
  <291>.
  <false> is not true.
/<<PKGBUILDDIR>>/test/test_examples.rb:120:in `rescue in assert_sample_file_has_no_output'
/<<PKGBUILDDIR>>/test/test_examples.rb:114:in `assert_sample_file_has_no_output'
/<<PKGBUILDDIR>>/test/test_examples.rb:92:in `block in make_sample_test_method'
===============================================================================
: (0.135045)
  test_sample68:					F
===============================================================================
Failure: test_sample68(GraphVizTest):
  got exception on sample68.rb: expecting empty errorput got [Ignoring debug-1.4.0 because its extensions are not built. Try: gem pristine debug --version 1.4.0
  Ignoring rbs-2.1.0 because its extensions are not built. Try: gem pristine rbs --version 2.1.0
  Ignoring sdbm-1.0.0 because its extensions are not built. Try: gem pristine sdbm --version 1.0.0
  ].
  <0> expected but was
  <291>.
  <false> is not true.
/<<PKGBUILDDIR>>/test/test_examples.rb:120:in `rescue in assert_sample_file_has_no_output'
/<<PKGBUILDDIR>>/test/test_examples.rb:114:in `assert_sample_file_has_no_output'
/<<PKGBUILDDIR>>/test/test_examples.rb:92:in `block in make_sample_test_method'
===============================================================================
: (0.414256)
  test_sample69:					F
===============================================================================
Failure: test_sample69(GraphVizTest):
  got exception on sample69.rb: expecting empty errorput got [Ignoring debug-1.4.0 because its extensions are not built. Try: gem pristine debug --version 1.4.0
  Ignoring rbs-2.1.0 because its extensions are not built. Try: gem pristine rbs --version 2.1.0
  Ignoring sdbm-1.0.0 because its extensions are not built. Try: gem pristine sdbm --version 1.0.0
  ].
  <0> expected but was
  <291>.
  <false> is not true.
/<<PKGBUILDDIR>>/test/test_examples.rb:120:in `rescue in assert_sample_file_has_no_output'
/<<PKGBUILDDIR>>/test/test_examples.rb:114:in `assert_sample_file_has_no_output'
/<<PKGBUILDDIR>>/test/test_examples.rb:92:in `block in make_sample_test_method'
===============================================================================
: (0.125704)
  test_sample70:					F
===============================================================================
Failure: test_sample70(GraphVizTest)
/<<PKGBUILDDIR>>/test/test_examples.rb:110:in `assert_output_pattern'
/<<PKGBUILDDIR>>/test/test_examples.rb:61:in `test_sample70'
     58:   end
     59: 
     60:   def test_sample70
  => 61:     assert_output_pattern(/\Agraph G \{.*\}\n\Z/m, '70')
     62:   end
     63: 
     64:   #
no errors
<""> expected but was
<"Ignoring debug-1.4.0 because its extensions are not built. Try: gem pristine debug --version 1.4.0\n" +
"Ignoring rbs-2.1.0 because its extensions are not built. Try: gem pristine rbs --version 2.1.0\n" +
"Ignoring sdbm-1.0.0 because its extensions are not built. Try: gem pristine sdbm --version 1.0.0\n">
===============================================================================
: (0.125080)
  test_sample71:					F
===============================================================================
Failure: test_sample71(GraphVizTest):
  got exception on sample71.rb: expecting empty errorput got [Ignoring debug-1.4.0 because its extensions are not built. Try: gem pristine debug --version 1.4.0
  Ignoring rbs-2.1.0 because its extensions are not built. Try: gem pristine rbs --version 2.1.0
  Ignoring sdbm-1.0.0 because its extensions are not built. Try: gem pristine sdbm --version 1.0.0
  ].
  <0> expected but was
  <291>.
  <false> is not true.
/<<PKGBUILDDIR>>/test/test_examples.rb:120:in `rescue in assert_sample_file_has_no_output'
/<<PKGBUILDDIR>>/test/test_examples.rb:114:in `assert_sample_file_has_no_output'
/<<PKGBUILDDIR>>/test/test_examples.rb:92:in `block in make_sample_test_method'
===============================================================================
: (0.129489)
  test_sample72:					F
===============================================================================
Failure: test_sample72(GraphVizTest):
  got exception on sample72.rb: expecting empty errorput got [Ignoring debug-1.4.0 because its extensions are not built. Try: gem pristine debug --version 1.4.0
  Ignoring rbs-2.1.0 because its extensions are not built. Try: gem pristine rbs --version 2.1.0
  Ignoring sdbm-1.0.0 because its extensions are not built. Try: gem pristine sdbm --version 1.0.0
  ].
  <0> expected but was
  <291>.
  <false> is not true.
/<<PKGBUILDDIR>>/test/test_examples.rb:120:in `rescue in assert_sample_file_has_no_output'
/<<PKGBUILDDIR>>/test/test_examples.rb:114:in `assert_sample_file_has_no_output'
/<<PKGBUILDDIR>>/test/test_examples.rb:92:in `block in make_sample_test_method'
===============================================================================
: (0.131690)
  test_sample73:					F
===============================================================================
Failure: test_sample73(GraphVizTest):
  got exception on sample73.rb: expecting empty errorput got [Ignoring debug-1.4.0 because its extensions are not built. Try: gem pristine debug --version 1.4.0
  Ignoring rbs-2.1.0 because its extensions are not built. Try: gem pristine rbs --version 2.1.0
  Ignoring sdbm-1.0.0 because its extensions are not built. Try: gem pristine sdbm --version 1.0.0
  ].
  <0> expected but was
  <291>.
  <false> is not true.
/<<PKGBUILDDIR>>/test/test_examples.rb:120:in `rescue in assert_sample_file_has_no_output'
/<<PKGBUILDDIR>>/test/test_examples.rb:114:in `assert_sample_file_has_no_output'
/<<PKGBUILDDIR>>/test/test_examples.rb:92:in `block in make_sample_test_method'
===============================================================================
: (0.130056)
  test_sample74:					F
===============================================================================
Failure: test_sample74(GraphVizTest):
  got exception on sample74.rb: expecting empty errorput got [Ignoring debug-1.4.0 because its extensions are not built. Try: gem pristine debug --version 1.4.0
  Ignoring rbs-2.1.0 because its extensions are not built. Try: gem pristine rbs --version 2.1.0
  Ignoring sdbm-1.0.0 because its extensions are not built. Try: gem pristine sdbm --version 1.0.0
  ].
  <0> expected but was
  <291>.
  <false> is not true.
/<<PKGBUILDDIR>>/test/test_examples.rb:120:in `rescue in assert_sample_file_has_no_output'
/<<PKGBUILDDIR>>/test/test_examples.rb:114:in `assert_sample_file_has_no_output'
/<<PKGBUILDDIR>>/test/test_examples.rb:92:in `block in make_sample_test_method'
===============================================================================
: (0.125028)
  test_search:						.: (0.000869)
  test_to_s:						.: (0.000398)
GraphVizTheoryTest: 
  test_adgency_matrix:					.: (0.000714)
  test_critical_path:					.: (0.001583)
  test_degree:						.: (0.000341)
  test_dijkstra_a_f:					.: (0.001222)
  test_escaped_node_ids__adjancy_matrix:		.: (0.000346)
  test_incidence_matrix:				.: (0.000828)
  test_laplacian_matrix:				.: (0.000900)
  test_range:						.: (0.001033)
  test_symetric:					.: (0.000521)
  test_theory:						.: (0.000322)
TypesTest: 
  test_color:						.: (0.000222)
  test_color_by_hsv:					.: (0.000143)
  test_color_by_name:					.: (0.000114)
  test_color_by_rgb:					.: (0.000143)
  test_gv_bool:						.: (0.000247)

Finished in 10.713072811 seconds.
-------------------------------------------------------------------------------
100 tests, 308 assertions, 70 failures, 0 errors, 0 pendings, 0 omissions, 0 notifications
30% passed
-------------------------------------------------------------------------------
9.33 tests/s, 28.75 assertions/s
rake aborted!
Command failed with status (1): [ruby -w -I"test" /usr/lib/ruby/gems/3.1.0/gems/rake-13.0.6/lib/rake/rake_test_loader.rb "test/test_dot_script.rb" "test/test_examples.rb" "test/test_graph.rb" "test/test_search.rb" "test/test_subgraph.rb" "test/test_theory.rb" "test/test_types.rb" "test/test_utils_colors.rb" -v]

Tasks: TOP => default
(See full trace by running task with --trace)
ERROR: Test "ruby3.1" failed. Exiting.
dh_auto_install: error: dh_ruby --install /<<PKGBUILDDIR>>/debian/ruby-graphviz returned exit code 1
make: *** [debian/rules:8: binary] Error 25
dpkg-buildpackage: error: debian/rules binary subprocess returned exit status 2
--------------------------------------------------------------------------------
Build finished at 2022-09-12T18:35:00Z

Finished
--------


+------------------------------------------------------------------------------+
| Cleanup                                                                      |
+------------------------------------------------------------------------------+

Purging /<<BUILDDIR>>
Not cleaning session: cloned chroot in use
E: Build failure (dpkg-buildpackage died)

+------------------------------------------------------------------------------+
| Summary                                                                      |
+------------------------------------------------------------------------------+

Build Architecture: amd64
Build Type: binary
Build-Space: 5040
Build-Time: 24
Distribution: experimental
Fail-Stage: build
Host Architecture: amd64
Install-Time: 13
Job: /home/admin/mass-rebuild/builds/17/ruby-graphviz/ruby-graphviz_1.2.5-2+rebuild1663007659.dsc
Machine Architecture: amd64
Package: ruby-graphviz
Package-Time: 40
Source-Version: 1.2.5-2+rebuild1663007659
Space: 5040
Status: attempted
Version: 1.2.5-2+rebuild1663007659
--------------------------------------------------------------------------------
Finished at 2022-09-12T18:35:00Z
Build needed 00:00:40, 5040k disk space